{"text_format":"3","workbook":"xlsx","n_sheets":9,"sheets":["Plan","BD","Fériés","ParamètresCouleurs","Couleurs","modèle","F_Balu","F_Bernier","F_Dupond"],"not_rendered":{"macros":1,"defined_names":7},"read":"whole","date_system":"1900"}

{"sheet":"Plan","index":0,"n_rows":23,"n_cols":278,"rows_kept":23}
[null,{"$f":"DATE(Année,1,1)","v":"2018-01-01"},{"$f":"IF(MONTH(B3)<>MONTH(C3),TEXT(C3,\"mmmm aa\"),\"\")","v":""},"","","","","","","","","","","","","","","","","","","","","février 18","","","","","","","","","","","","","","","","","","","","mars 18","","","","","","","","","","","","","","","","","","","","","","avril 18",{"$f":"IF(MONTH(BN3)<>MONTH(BO3),TEXT(BO3,\"mmmm aa\"),\"\")","v":""},"","","","","","","","","","","","","","","","","","","mai 18","","","","","","","","","","","","","","","","","","","juin 18","","","","","","","","","","","","","","","","","","","","","juillet 18","","","","",{"$f":"IF(MONTH(DZ3)<>MONTH(EA3),TEXT(EA3,\"mmmm aa\"),\"\")","v":""},"","","","","","","","","","","","","","","","","août 18","","","","","","","","","","","","","","","","","","","","","","septembre 18","","","","","","","","","","","","",{"$f":"IF(MONTH(FZ3)<>MONTH(GA3),TEXT(GA3,\"mmmm aa\"),\"\")","v":""},{"$f":"IF(MONTH(GA3)<>MONTH(GB3),TEXT(GB3,\"mmmm aa\"),\"\")","v":""},{"$f":"IF(MONTH(GB3)<>MONTH(GC3),TEXT(GC3,\"mmmm aa\"),\"\")","v":""},{"$f":"IF(MONTH(GC3)<>MONTH(GD3),TEXT(GD3,\"mmmm aa\"),\"\")","v":""},{"$f":"IF(MONTH(GD3)<>MONTH(GE3),TEXT(GE3,\"mmmm aa\"),\"\")","v":""},{"$f":"IF(MONTH(GE3)<>MONTH(GF3),TEXT(GF3,\"mmmm aa\"),\"\")","v":""},{"$f":"IF(MONTH(GF3)<>MONTH(GG3),TEXT(GG3,\"mmmm aa\"),\"\")","v":""},{"$f":"IF(MONTH(GG3)<>MONTH(GH3),TEXT(GH3,\"mmmm aa\"),\"\")","v":"octobre 18"},{"$f":"IF(MONTH(GH3)<>MONTH(GI3),TEXT(GI3,\"mmmm aa\"),\"\")","v":""},{"$f":"IF(MONTH(GI3)<>MONTH(GJ3),TEXT(GJ3,\"mmmm aa\"),\"\")","v":""},{"$f":"IF(MONTH(GJ3)<>MONTH(GK3),TEXT(GK3,\"mmmm aa\"),\"\")","v":""},{"$f":"IF(MONTH(GK3)<>MONTH(GL3),TEXT(GL3,\"mmmm aa\"),\"\")","v":""},{"$f":"IF(MONTH(GL3)<>MONTH(GM3),TEXT(GM3,\"mmmm aa\"),\"\")","v":""},{"$f":"IF(MONTH(GM3)<>MONTH(GN3),TEXT(GN3,\"mmmm aa\"),\"\")","v":""},{"$f":"IF(MONTH(GN3)<>MONTH(GO3),TEXT(GO3,\"mmmm aa\"),\"\")","v":""},{"$f":"IF(MONTH(GO3)<>MONTH(GP3),TEXT(GP3,\"mmmm aa\"),\"\")","v":""},{"$f":"IF(MONTH(GP3)<>MONTH(GQ3),TEXT(GQ3,\"mmmm aa\"),\"\")","v":""},{"$f":"IF(MONTH(GQ3)<>MONTH(GR3),TEXT(GR3,\"mmmm aa\"),\"\")","v":""},{"$f":"IF(MONTH(GR3)<>MONTH(GS3),TEXT(GS3,\"mmmm aa\"),\"\")","v":""},{"$f":"IF(MONTH(GS3)<>MONTH(GT3),TEXT(GT3,\"mmmm aa\"),\"\")","v":""},{"$f":"IF(MONTH(GT3)<>MONTH(GU3),TEXT(GU3,\"mmmm aa\"),\"\")","v":""},{"$f":"IF(MONTH(GU3)<>MONTH(GV3),TEXT(GV3,\"mmmm aa\"),\"\")","v":""},{"$f":"IF(MONTH(GV3)<>MONTH(GW3),TEXT(GW3,\"mmmm aa\"),\"\")","v":""},{"$f":"IF(MONTH(GW3)<>MONTH(GX3),TEXT(GX3,\"mmmm aa\"),\"\")","v":""},{"$f":"IF(MONTH(GX3)<>MONTH(GY3),TEXT(GY3,\"mmmm aa\"),\"\")","v":""},{"$f":"IF(MONTH(GY3)<>MONTH(GZ3),TEXT(GZ3,\"mmmm aa\"),\"\")","v":""},{"$f":"IF(MONTH(GZ3)<>MONTH(HA3),TEXT(HA3,\"mmmm aa\"),\"\")","v":""},{"$f":"IF(MONTH(HA3)<>MONTH(HB3),TEXT(HB3,\"mmmm aa\"),\"\")","v":""},{"$f":"IF(MONTH(HB3)<>MONTH(HC3),TEXT(HC3,\"mmmm aa\"),\"\")","v":""},{"$f":"IF(MONTH(HC3)<>MONTH(HD3),TEXT(HD3,\"mmmm aa\"),\"\")","v":""},{"$f":"IF(MONTH(HD3)<>MONTH(HE3),TEXT(HE3,\"mmmm aa\"),\"\")","v":"novembre 18"},{"$f":"IF(MONTH(HE3)<>MONTH(HF3),TEXT(HF3,\"mmmm aa\"),\"\")","v":""},{"$f":"IF(MONTH(HF3)<>MONTH(HG3),TEXT(HG3,\"mmmm aa\"),\"\")","v":""},{"$f":"IF(MONTH(HG3)<>MONTH(HH3),TEXT(HH3,\"mmmm aa\"),\"\")","v":""},{"$f":"IF(MONTH(HH3)<>MONTH(HI3),TEXT(HI3,\"mmmm aa\"),\"\")","v":""},{"$f":"IF(MONTH(HI3)<>MONTH(HJ3),TEXT(HJ3,\"mmmm aa\"),\"\")","v":""},{"$f":"IF(MONTH(HJ3)<>MONTH(HK3),TEXT(HK3,\"mmmm aa\"),\"\")","v":""},{"$f":"IF(MONTH(HK3)<>MONTH(HL3),TEXT(HL3,\"mmmm aa\"),\"\")","v":""},{"$f":"IF(MONTH(HL3)<>MONTH(HM3),TEXT(HM3,\"mmmm aa\"),\"\")","v":""},{"$f":"IF(MONTH(HM3)<>MONTH(HN3),TEXT(HN3,\"mmmm aa\"),\"\")","v":""},{"$f":"IF(MONTH(HN3)<>MONTH(HO3),TEXT(HO3,\"mmmm aa\"),\"\")","v":""},{"$f":"IF(MONTH(HO3)<>MONTH(HP3),TEXT(HP3,\"mmmm aa\"),\"\")","v":""},{"$f":"IF(MONTH(HP3)<>MONTH(HQ3),TEXT(HQ3,\"mmmm aa\"),\"\")","v":""},{"$f":"IF(MONTH(HQ3)<>MONTH(HR3),TEXT(HR3,\"mmmm aa\"),\"\")","v":""},{"$f":"IF(MONTH(HR3)<>MONTH(HS3),TEXT(HS3,\"mmmm aa\"),\"\")","v":""},{"$f":"IF(MONTH(HS3)<>MONTH(HT3),TEXT(HT3,\"mmmm aa\"),\"\")","v":""},{"$f":"IF(MONTH(HT3)<>MONTH(HU3),TEXT(HU3,\"mmmm aa\"),\"\")","v":""},{"$f":"IF(MONTH(HU3)<>MONTH(HV3),TEXT(HV3,\"mmmm aa\"),\"\")","v":""},{"$f":"IF(MONTH(HV3)<>MONTH(HW3),TEXT(HW3,\"mmmm aa\"),\"\")","v":""},{"$f":"IF(MONTH(HW3)<>MONTH(HX3),TEXT(HX3,\"mmmm aa\"),\"\")","v":""},{"$f":"IF(MONTH(HX3)<>MONTH(HY3),TEXT(HY3,\"mmmm aa\"),\"\")","v":""},{"$f":"IF(MONTH(HY3)<>MONTH(HZ3),TEXT(HZ3,\"mmmm aa\"),\"\")","v":"décembre 18"},{"$f":"IF(MONTH(HZ3)<>MONTH(IA3),TEXT(IA3,\"mmmm aa\"),\"\")","v":""},{"$f":"IF(MONTH(IA3)<>MONTH(IB3),TEXT(IB3,\"mmmm aa\"),\"\")","v":""},{"$f":"IF(MONTH(IB3)<>MONTH(IC3),TEXT(IC3,\"mmmm aa\"),\"\")","v":""},{"$f":"IF(MONTH(IC3)<>MONTH(ID3),TEXT(ID3,\"mmmm aa\"),\"\")","v":""},{"$f":"IF(MONTH(ID3)<>MONTH(IE3),TEXT(IE3,\"mmmm aa\"),\"\")","v":""},{"$f":"IF(MONTH(IE3)<>MONTH(IF3),TEXT(IF3,\"mmmm aa\"),\"\")","v":""},{"$f":"IF(MONTH(IF3)<>MONTH(IG3),TEXT(IG3,\"mmmm aa\"),\"\")","v":""},{"$f":"IF(MONTH(IG3)<>MONTH(IH3),TEXT(IH3,\"mmmm aa\"),\"\")","v":""},{"$f":"IF(MONTH(IH3)<>MONTH(II3),TEXT(II3,\"mmmm aa\"),\"\")","v":""},{"$f":"IF(MONTH(II3)<>MONTH(IJ3),TEXT(IJ3,\"mmmm aa\"),\"\")","v":""},{"$f":"IF(MONTH(IJ3)<>MONTH(IK3),TEXT(IK3,\"mmmm aa\"),\"\")","v":""},{"$f":"IF(MONTH(IK3)<>MONTH(IL3),TEXT(IL3,\"mmmm aa\"),\"\")","v":""},{"$f":"IF(MONTH(IL3)<>MONTH(IM3),TEXT(IM3,\"mmmm aa\"),\"\")","v":""},{"$f":"IF(MONTH(IM3)<>MONTH(IN3),TEXT(IN3,\"mmmm aa\"),\"\")","v":""},{"$f":"IF(MONTH(IN3)<>MONTH(IO3),TEXT(IO3,\"mmmm aa\"),\"\")","v":""},{"$f":"IF(MONTH(IO3)<>MONTH(IP3),TEXT(IP3,\"mmmm aa\"),\"\")","v":""},{"$f":"IF(MONTH(IP3)<>MONTH(IQ3),TEXT(IQ3,\"mmmm aa\"),\"\")","v":""},{"$f":"IF(MONTH(IQ3)<>MONTH(IR3),TEXT(IR3,\"mmmm aa\"),\"\")","v":""},{"$f":"IF(MONTH(IR3)<>MONTH(IS3),TEXT(IS3,\"mmmm aa\"),\"\")","v":""},{"$f":"IF(MONTH(IS3)<>MONTH(IT3),TEXT(IT3,\"mmmm aa\"),\"\")","v":"janvier 19"},{"$f":"IF(MONTH(IT3)<>MONTH(IU3),TEXT(IU3,\"mmmm aa\"),\"\")","v":""},{"$f":"IF(MONTH(IU3)<>MONTH(IV3),TEXT(IV3,\"mmmm aa\"),\"\")","v":""},{"$f":"IF(MONTH(IV3)<>MONTH(IW3),TEXT(IW3,\"mmmm aa\"),\"\")","v":""},{"$f":"IF(MONTH(IW3)<>MONTH(IX3),TEXT(IX3,\"mmmm aa\"),\"\")","v":""},{"$f":"IF(MONTH(IX3)<>MONTH(IY3),TEXT(IY3,\"mmmm aa\"),\"\")","v":""},{"$f":"IF(MONTH(IY3)<>MONTH(IZ3),TEXT(IZ3,\"mmmm aa\"),\"\")","v":""},{"$f":"IF(MONTH(IZ3)<>MONTH(JA3),TEXT(JA3,\"mmmm aa\"),\"\")","v":""},{"$f":"IF(MONTH(JA3)<>MONTH(JB3),TEXT(JB3,\"mmmm aa\"),\"\")","v":""},{"$f":"IF(MONTH(JB3)<>MONTH(JC3),TEXT(JC3,\"mmmm aa\"),\"\")","v":""},{"$f":"IF(MONTH(JC3)<>MONTH(JD3),TEXT(JD3,\"mmmm aa\"),\"\")","v":""},{"$f":"IF(MONTH(JD3)<>MONTH(JE3),TEXT(JE3,\"mmmm aa\"),\"\")","v":""},{"$f":"IF(MONTH(JE3)<>MONTH(JF3),TEXT(JF3,\"mmmm aa\"),\"\")","v":""},{"$f":"IF(MONTH(JF3)<>MONTH(JG3),TEXT(JG3,\"mmmm aa\"),\"\")","v":""},{"$f":"IF(MONTH(JG3)<>MONTH(JH3),TEXT(JH3,\"mmmm aa\"),\"\")","v":""},{"$f":"IF(MONTH(JH3)<>MONTH(JI3),TEXT(JI3,\"mmmm aa\"),\"\")","v":""},{"$f":"IF(MONTH(JI3)<>MONTH(JJ3),TEXT(JJ3,\"mmmm aa\"),\"\")","v":""},{"$f":"IF(MONTH(JJ3)<>MONTH(JK3),TEXT(JK3,\"mmmm aa\"),\"\")","v":""},{"$f":"IF(MONTH(JK3)<>MONTH(JL3),TEXT(JL3,\"mmmm aa\"),\"\")","v":""},{"$f":"IF(MONTH(JL3)<>MONTH(JM3),TEXT(JM3,\"mmmm aa\"),\"\")","v":""},{"$f":"IF(MONTH(JM3)<>MONTH(JN3),TEXT(JN3,\"mmmm aa\"),\"\")","v":""},{"$f":"IF(MONTH(JN3)<>MONTH(JO3),TEXT(JO3,\"mmmm aa\"),\"\")","v":""},{"$f":"IF(MONTH(JO3)<>MONTH(JP3),TEXT(JP3,\"mmmm aa\"),\"\")","v":""},{"$f":"IF(MONTH(JP3)<>MONTH(JQ3),TEXT(JQ3,\"mmmm aa\"),\"\")","v":"février 19"},{"$f":"IF(MONTH(JQ3)<>MONTH(JR3),TEXT(JR3,\"mmmm aa\"),\"\")","v":""}]
[null,{"$f":"DATE(Année,1,2)","v":"2018-01-02"},{"$f":"WORKDAY(B2,1,fériés)","v":"2018-01-03"},"2018-01-04","2018-01-05","2018-01-08","2018-01-09","2018-01-10","2018-01-11","2018-01-12","2018-01-15","2018-01-16","2018-01-17","2018-01-18","2018-01-19","2018-01-22","2018-01-23","2018-01-24","2018-01-25","2018-01-26","2018-01-29","2018-01-30","2018-01-31","2018-02-01","2018-02-02","2018-02-05","2018-02-06","2018-02-07","2018-02-08","2018-02-09","2018-02-12","2018-02-13","2018-02-14","2018-02-15","2018-02-16","2018-02-19","2018-02-20","2018-02-21","2018-02-22","2018-02-23","2018-02-26","2018-02-27","2018-02-28","2018-03-01","2018-03-02","2018-03-05","2018-03-06","2018-03-07","2018-03-08","2018-03-09","2018-03-12","2018-03-13","2018-03-14","2018-03-15","2018-03-16","2018-03-19","2018-03-20","2018-03-21","2018-03-22","2018-03-23","2018-03-26","2018-03-27","2018-03-28","2018-03-29","2018-03-30","2018-04-03",{"$f":"WORKDAY(BN2,1,fériés)","v":"2018-04-04"},"2018-04-05","2018-04-06","2018-04-09","2018-04-10","2018-04-11","2018-04-12","2018-04-13","2018-04-16","2018-04-17","2018-04-18","2018-04-19","2018-04-20","2018-04-23","2018-04-24","2018-04-25","2018-04-26","2018-04-27","2018-04-30","2018-05-02","2018-05-03","2018-05-04","2018-05-07","2018-05-09","2018-05-11","2018-05-14","2018-05-15","2018-05-16","2018-05-17","2018-05-18","2018-05-22","2018-05-23","2018-05-24","2018-05-25","2018-05-28","2018-05-29","2018-05-30","2018-05-31","2018-06-01","2018-06-04","2018-06-05","2018-06-06","2018-06-07","2018-06-08","2018-06-11","2018-06-12","2018-06-13","2018-06-14","2018-06-15","2018-06-18","2018-06-19","2018-06-20","2018-06-21","2018-06-22","2018-06-25","2018-06-26","2018-06-27","2018-06-28","2018-06-29","2018-07-02","2018-07-03","2018-07-04","2018-07-05","2018-07-06",{"$f":"WORKDAY(DZ2,1,fériés)","v":"2018-07-09"},"2018-07-10","2018-07-11","2018-07-12","2018-07-13","2018-07-16","2018-07-17","2018-07-18","2018-07-19","2018-07-20","2018-07-23","2018-07-24","2018-07-25","2018-07-26","2018-07-27","2018-07-30","2018-07-31","2018-08-01","2018-08-02","2018-08-03","2018-08-06","2018-08-07","2018-08-08","2018-08-09","2018-08-10","2018-08-13","2018-08-14","2018-08-16","2018-08-17","2018-08-20","2018-08-21","2018-08-22","2018-08-23","2018-08-24","2018-08-27","2018-08-28","2018-08-29","2018-08-30","2018-08-31","2018-09-03","2018-09-04","2018-09-05","2018-09-06","2018-09-07","2018-09-10","2018-09-11","2018-09-12","2018-09-13","2018-09-14","2018-09-17","2018-09-18","2018-09-19","2018-09-20","2018-09-21","2018-09-24","2018-09-25","2018-09-26","2018-09-27","2018-09-28","2018-10-01","2018-10-02","2018-10-03","2018-10-04","2018-10-05",{"$f":"WORKDAY(GL2,1,fériés)","v":"2018-10-08"},"2018-10-09","2018-10-10","2018-10-11","2018-10-12","2018-10-15","2018-10-16","2018-10-17","2018-10-18","2018-10-19","2018-10-22","2018-10-23","2018-10-24","2018-10-25","2018-10-26","2018-10-29","2018-10-30","2018-10-31","2018-11-02","2018-11-05","2018-11-06","2018-11-07","2018-11-08","2018-11-09","2018-11-12","2018-11-13","2018-11-14","2018-11-15","2018-11-16","2018-11-19","2018-11-20","2018-11-21","2018-11-22","2018-11-23","2018-11-26","2018-11-27","2018-11-28","2018-11-29","2018-11-30","2018-12-03","2018-12-04","2018-12-05","2018-12-06","2018-12-07","2018-12-10","2018-12-11","2018-12-12","2018-12-13","2018-12-14","2018-12-17","2018-12-18","2018-12-19","2018-12-20","2018-12-21","2018-12-24","2018-12-26","2018-12-27","2018-12-28","2018-12-31","2019-01-01","2019-01-02","2019-01-03","2019-01-04","2019-01-07",{"$f":"WORKDAY(IX2,1,fériés)","v":"2019-01-08"},"2019-01-09","2019-01-10","2019-01-11","2019-01-14","2019-01-15","2019-01-16","2019-01-17","2019-01-18","2019-01-21","2019-01-22","2019-01-23","2019-01-24","2019-01-25","2019-01-28","2019-01-29","2019-01-30","2019-01-31","2019-02-01","2019-02-04"]
[null,{"$f":"DATE(Année,1,2)","v":"2018-01-02"},{"$f":"WORKDAY(B3,1,fériés)","v":"2018-01-03"},"2018-01-04","2018-01-05","2018-01-08","2018-01-09","2018-01-10","2018-01-11","2018-01-12","2018-01-15","2018-01-16","2018-01-17","2018-01-18","2018-01-19","2018-01-22","2018-01-23","2018-01-24","2018-01-25","2018-01-26","2018-01-29","2018-01-30","2018-01-31","2018-02-01","2018-02-02","2018-02-05","2018-02-06","2018-02-07","2018-02-08","2018-02-09","2018-02-12","2018-02-13","2018-02-14","2018-02-15","2018-02-16","2018-02-19","2018-02-20","2018-02-21","2018-02-22","2018-02-23","2018-02-26","2018-02-27","2018-02-28","2018-03-01","2018-03-02","2018-03-05","2018-03-06","2018-03-07","2018-03-08","2018-03-09","2018-03-12","2018-03-13","2018-03-14","2018-03-15","2018-03-16","2018-03-19","2018-03-20","2018-03-21","2018-03-22","2018-03-23","2018-03-26","2018-03-27","2018-03-28","2018-03-29","2018-03-30","2018-04-03",{"$f":"WORKDAY(BN3,1,fériés)","v":"2018-04-04"},"2018-04-05","2018-04-06","2018-04-09","2018-04-10","2018-04-11","2018-04-12","2018-04-13","2018-04-16","2018-04-17","2018-04-18","2018-04-19","2018-04-20","2018-04-23","2018-04-24","2018-04-25","2018-04-26","2018-04-27","2018-04-30","2018-05-02","2018-05-03","2018-05-04","2018-05-07","2018-05-09","2018-05-11","2018-05-14","2018-05-15","2018-05-16","2018-05-17","2018-05-18","2018-05-22","2018-05-23","2018-05-24","2018-05-25","2018-05-28","2018-05-29","2018-05-30","2018-05-31","2018-06-01","2018-06-04","2018-06-05","2018-06-06","2018-06-07","2018-06-08","2018-06-11","2018-06-12","2018-06-13","2018-06-14","2018-06-15","2018-06-18","2018-06-19","2018-06-20","2018-06-21","2018-06-22","2018-06-25","2018-06-26","2018-06-27","2018-06-28","2018-06-29","2018-07-02","2018-07-03","2018-07-04","2018-07-05","2018-07-06",{"$f":"WORKDAY(DZ3,1,fériés)","v":"2018-07-09"},"2018-07-10","2018-07-11","2018-07-12","2018-07-13","2018-07-16","2018-07-17","2018-07-18","2018-07-19","2018-07-20","2018-07-23","2018-07-24","2018-07-25","2018-07-26","2018-07-27","2018-07-30","2018-07-31","2018-08-01","2018-08-02","2018-08-03","2018-08-06","2018-08-07","2018-08-08","2018-08-09","2018-08-10","2018-08-13","2018-08-14","2018-08-16","2018-08-17","2018-08-20","2018-08-21","2018-08-22","2018-08-23","2018-08-24","2018-08-27","2018-08-28","2018-08-29","2018-08-30","2018-08-31","2018-09-03","2018-09-04","2018-09-05","2018-09-06","2018-09-07","2018-09-10","2018-09-11","2018-09-12","2018-09-13","2018-09-14","2018-09-17","2018-09-18","2018-09-19","2018-09-20","2018-09-21","2018-09-24","2018-09-25","2018-09-26","2018-09-27","2018-09-28","2018-10-01","2018-10-02","2018-10-03","2018-10-04","2018-10-05",{"$f":"WORKDAY(GL3,1,fériés)","v":"2018-10-08"},"2018-10-09","2018-10-10","2018-10-11","2018-10-12","2018-10-15","2018-10-16","2018-10-17","2018-10-18","2018-10-19","2018-10-22","2018-10-23","2018-10-24","2018-10-25","2018-10-26","2018-10-29","2018-10-30","2018-10-31","2018-11-02","2018-11-05","2018-11-06","2018-11-07","2018-11-08","2018-11-09","2018-11-12","2018-11-13","2018-11-14","2018-11-15","2018-11-16","2018-11-19","2018-11-20","2018-11-21","2018-11-22","2018-11-23","2018-11-26","2018-11-27","2018-11-28","2018-11-29","2018-11-30","2018-12-03","2018-12-04","2018-12-05","2018-12-06","2018-12-07","2018-12-10","2018-12-11","2018-12-12","2018-12-13","2018-12-14","2018-12-17","2018-12-18","2018-12-19","2018-12-20","2018-12-21","2018-12-24","2018-12-26","2018-12-27","2018-12-28","2018-12-31","2019-01-01","2019-01-02","2019-01-03","2019-01-04","2019-01-07",{"$f":"WORKDAY(IX3,1,fériés)","v":"2019-01-08"},"2019-01-09","2019-01-10","2019-01-11","2019-01-14","2019-01-15","2019-01-16","2019-01-17","2019-01-18","2019-01-21","2019-01-22","2019-01-23","2019-01-24","2019-01-25","2019-01-28","2019-01-29","2019-01-30","2019-01-31","2019-02-01","2019-02-04"]
["Balu","CP","CP","CP","CP","CP","CP",{"$nulls":10},"Cpa","Cpa"]
["Dupond",null,null,"Mat","Mat","Mat","Mat","Mat"]
["Bernier","Evf","Evf","Evf","Evf","Evf","Evf","Evf","Evf","Evf","Evf",{"$nulls":10},"AbsNR","AbsNR","AbsNR"]
["Bisson"]
["Dupont"]
["Durand"]
["Durandal"]
["Magdalou"]
["Magnier"]
["Martin"]
["Martinet"]
["Mazoni"]
["Mercier"]
["Miroux"]
["Nicolas"]
["Tantucci"]
["."]
["."]
["."]
["."]

{"sheet":"BD","index":1,"n_rows":6,"n_cols":5,"rows_kept":6}
["Nom","Début","Fin","TypeCongés","nb jours"]
["Balu","2018-01-02","2018-01-09","CP",6]
["Balu","2018-01-18","2018-01-19","Cpa",2]
["Bernier","2018-01-02","2018-01-15","Evf",10]
["Bernier","2018-01-22","2018-01-24","AbsNR",3]
["Dupond","2018-01-04","2018-01-10","Mat",5]

{"sheet":"Fériés","index":2,"n_rows":12,"n_cols":5,"rows_kept":12}
["Année",null,"Fériés",null,"Pâques"]
[2018,null,{"$f":"DATE(A2,1,1)","v":"2018-01-01"},null,{"$f":"ROUND(DATE(Année,4,MOD(234-11*MOD(Année,19),30))/7,0)*7-6","v":"2018-04-01"}]
[null,null,{"$f":"DATE(A2,5,1)","v":"2018-05-01"}]
[null,null,{"$f":"DATE(A2,5,8)","v":"2018-05-08"}]
[null,null,{"$f":"DATE(A2,7,14)","v":"2018-07-14"}]
[null,null,{"$f":"DATE(A2,8,15)","v":"2018-08-15"}]
[null,null,{"$f":"DATE(A2,11,1)","v":"2018-11-01"}]
[null,null,{"$f":"DATE(A2,11,11)","v":"2018-11-11"}]
[null,null,{"$f":"DATE(A2,12,25)","v":"2018-12-25"}]
[null,null,{"$f":"E2+1","v":"2018-04-02"}]
[null,null,{"$f":"E2+39","v":"2018-05-10"}]
[null,null,{"$f":"E2+50","v":"2018-05-21"}]

{"sheet":"ParamètresCouleurs","index":3,"n_rows":12,"n_cols":23,"rows_kept":12}
[{"$nulls":17},"Accueil"]
[]
[]
["Couleurs"]
["CP","Mal","Mat","Evf","Cpa","AbsNR","Cpat","Dj"]
["Congés","Maladie","Maternité","Evnt. Familial","Congé Parental","Absence non rému.","Congé Paternité","Demi-journée",{"$nulls":13},"Noms de champ"]
[{"$nulls":21},"Année","=Fériés!$A$2"]
[{"$nulls":21},"Congés","=ParamètresCouleurs!$A$5:$Q$5"]
[{"$nulls":21},"CongésSem","=Plan!$B$4:$NN$23"]
[{"$nulls":21},"fériés","=Fériés!$C$2:$C$12"]
[{"$nulls":21},"MesCouleurs","=ParamètresCouleurs!$A$5:$Q$5"]
[{"$nulls":21},"MotifsCongés","=ParamètresCouleurs!$A$6:$Q$6"]

{"sheet":"Couleurs","index":4,"n_rows":2,"n_cols":9,"rows_kept":2}
[]
[{"$nulls":8},"Généré automatiquement à partir de paramètresCouleurs"]

{"sheet":"modèle","index":5,"n_rows":117,"n_cols":229,"rows_kept":117}
[]
[]
[null,null,{"$f":"NOW()","v":"2018-01-21T12:58:21.490"}]
[]
[null,null,"Nom"]
[]
[{"$nulls":4},{"$f":"MotifsCongés","v":"Congés"},"Maladie","Maternité","Evnt. Familial","Congé Parental","Absence non rému.","Congé Paternité","Demi-journée"]
[null,null,"Date début","Date fin",{"$f":"Congés","v":"CP"},"Mal","Mat","Evf","Cpa","AbsNR","Cpat","Dj"]
{"$rows_empty":16}
[{"$nulls":4},{"$f":"SUM(E9:E24)","v":0},0,0,0,0,0,0,0]
{"$rows_empty":12}
[{"$nulls":70},"n"]
[{"$nulls":69},"2002-01-07","2002-01-08",null,"n"]
[{"$nulls":71},"2002-01-07","2002-01-08",null,"n"]
[{"$nulls":73},"2002-01-07","2002-01-08",null,"n"]
[{"$nulls":75},"2002-01-07","2002-01-08",null,"n"]
[{"$nulls":77},"2002-01-07","2002-01-08",null,"n"]
[{"$nulls":79},"2002-01-07","2002-01-08",null,"n"]
[{"$nulls":81},"2002-01-07","2002-01-08",null,"n"]
[{"$nulls":83},"2002-01-07","2002-01-08",null,"n"]
[{"$nulls":85},"2002-01-07","2002-01-08",null,"n"]
[{"$nulls":87},"2002-01-07","2002-01-08",null,"n"]
[{"$nulls":89},"2002-01-07","2002-01-08",null,"n"]
[{"$nulls":91},"2002-01-07","2002-01-08",null,"n"]
[{"$nulls":93},"2002-01-07","2002-01-08",null,"n"]
[{"$nulls":95},"2002-01-07","2002-01-08",null,"n"]
[{"$nulls":97},"2002-01-07","2002-01-08",null,"n"]
[{"$nulls":99},"2002-01-07","2002-01-08",null,"n"]
[{"$nulls":101},"2002-01-07","2002-01-08",null,"n"]
[{"$nulls":103},"2002-01-07","2002-01-08",null,"n"]
[{"$nulls":105},"2002-01-07","2002-01-08",null,"n"]
[{"$nulls":107},"2002-01-07","2002-01-08",null,"n"]
[{"$nulls":109},"2002-01-07","2002-01-08",null,"n"]
[{"$nulls":111},"2002-01-07","2002-01-08",null,"n"]
[{"$nulls":113},"2002-01-07","2002-01-08",null,"n"]
[{"$nulls":115},"2002-01-07","2002-01-08",null,"n"]
[{"$nulls":117},"2002-01-07","2002-01-08",null,"n"]
[{"$nulls":119},"2002-01-07","2002-01-08",null,"n"]
[{"$nulls":121},"2002-01-07","2002-01-08",null,"n"]
[{"$nulls":123},"2002-01-07","2002-01-08",null,"n"]
[{"$nulls":125},"2002-01-07","2002-01-08",null,"n"]
[{"$nulls":127},"2002-01-07","2002-01-08",null,"n"]
[{"$nulls":129},"2002-01-07","2002-01-08",null,"n"]
[{"$nulls":131},"2002-01-07","2002-01-08",null,"n"]
[{"$nulls":133},"2002-01-07","2002-01-08",null,"n"]
[{"$nulls":135},"2002-01-07","2002-01-08",null,"n"]
[{"$nulls":137},"2002-01-07","2002-01-08",null,"n"]
[{"$nulls":139},"2002-01-07","2002-01-08",null,"n"]
[{"$nulls":141},"2002-01-07","2002-01-08",null,"n"]
[{"$nulls":143},"2002-01-07","2002-01-08",null,"n"]
[{"$nulls":145},"2002-01-07","2002-01-08",null,"n"]
[{"$nulls":147},"2002-01-07","2002-01-08",null,"n"]
[{"$nulls":149},"2002-01-07","2002-01-08",null,"n"]
[{"$nulls":151},"2002-01-07","2002-01-08",null,"n"]
[{"$nulls":153},"2002-01-07","2002-01-08",null,"n"]
[{"$nulls":155},"2002-01-07","2002-01-08",null,"n"]
[{"$nulls":157},"2002-01-07","2002-01-08",null,"n"]
[{"$nulls":159},"2002-01-07","2002-01-08",null,"n"]
[{"$nulls":161},"2002-01-07","2002-01-08",null,"n"]
[{"$nulls":163},"2002-01-07","2002-01-08",null,"n"]
[{"$nulls":165},"2002-01-07","2002-01-08",null,"n"]
[{"$nulls":167},"2002-01-07","2002-01-08",null,"n"]
[{"$nulls":169},"2002-01-07","2002-01-08",null,"n"]
[{"$nulls":171},"2002-01-07","2002-01-08",null,"n"]
[{"$nulls":173},"2002-01-07","2002-01-08",null,"n"]
[{"$nulls":175},"2002-01-07","2002-01-08",null,"n"]
[{"$nulls":177},"2002-01-07","2002-01-08",null,"n"]
[{"$nulls":179},"2002-01-07","2002-01-08",null,"n"]
[{"$nulls":181},"2002-01-07","2002-01-08",null,"n"]
[{"$nulls":183},"2002-01-07","2002-01-08",null,"n"]
[{"$nulls":185},"2002-01-07","2002-01-08",null,"n"]
[{"$nulls":187},"2002-01-07","2002-01-08",null,"n"]
[{"$nulls":189},"2002-01-07","2002-01-08",null,"n"]
[{"$nulls":191},"2002-01-07","2002-01-08",null,"n"]
[{"$nulls":193},"2002-01-07","2002-01-08",null,"n"]
[{"$nulls":195},"2002-01-07","2002-01-08",null,"n"]
[{"$nulls":197},"2002-01-07","2002-01-08",null,"n"]
[{"$nulls":199},"2002-01-07","2002-01-08",null,"n"]
[{"$nulls":201},"2002-01-07","2002-01-08",null,"n"]
[{"$nulls":203},"2002-01-07","2002-01-08",null,"n"]
[{"$nulls":205},"2002-01-07","2002-01-08",null,"n"]
[{"$nulls":207},"2002-01-07","2002-01-08",null,"n"]
[{"$nulls":209},"2002-01-07","2002-01-08",null,"n"]
[{"$nulls":211},"2002-01-07","2002-01-08",null,"n"]
[{"$nulls":213},"2002-01-07","2002-01-08",null,"n"]
[{"$nulls":215},"2002-01-07","2002-01-08",null,"n"]
[{"$nulls":217},"2002-01-07","2002-01-08",null,"n"]
[{"$nulls":219},"2002-01-07","2002-01-08",null,"n"]
[{"$nulls":221},"2002-01-07","2002-01-08",null,"n"]
[{"$nulls":223},"2002-01-07","2002-01-08",null,"n"]
[{"$nulls":225},"2002-01-07","2002-01-08",null,"n"]

{"sheet":"F_Balu","index":6,"n_rows":117,"n_cols":229,"rows_kept":117}
[]
[]
[null,null,{"$f":"NOW()","v":"2018-01-21T12:58:21.490"}]
[]
[null,null,"Nom","Balu"]
[]
[{"$nulls":4},"Congés","Maladie","Maternité","Evnt. Familial","Congé Parental","Absence non rému.","Congé Paternité","Demi-journée"]
[null,null,"Date début","Date fin","CP","Mal","Mat","Evf","Cpa","AbsNR","Cpat","Dj"]
[null,null,"2018-01-02","2018-01-09",6]
[null,null,"2018-01-18","2018-01-19",{"$nulls":4},2]
{"$rows_empty":14}
[{"$nulls":4},{"$f":"SUM(E9:E24)","v":6},0,0,0,2,0,0,0]
{"$rows_empty":12}
[{"$nulls":70},"n"]
[{"$nulls":69},"2002-01-07","2002-01-08",null,"n"]
[{"$nulls":71},"2002-01-07","2002-01-08",null,"n"]
[{"$nulls":73},"2002-01-07","2002-01-08",null,"n"]
[{"$nulls":75},"2002-01-07","2002-01-08",null,"n"]
[{"$nulls":77},"2002-01-07","2002-01-08",null,"n"]
[{"$nulls":79},"2002-01-07","2002-01-08",null,"n"]
[{"$nulls":81},"2002-01-07","2002-01-08",null,"n"]
[{"$nulls":83},"2002-01-07","2002-01-08",null,"n"]
[{"$nulls":85},"2002-01-07","2002-01-08",null,"n"]
[{"$nulls":87},"2002-01-07","2002-01-08",null,"n"]
[{"$nulls":89},"2002-01-07","2002-01-08",null,"n"]
[{"$nulls":91},"2002-01-07","2002-01-08",null,"n"]
[{"$nulls":93},"2002-01-07","2002-01-08",null,"n"]
[{"$nulls":95},"2002-01-07","2002-01-08",null,"n"]
[{"$nulls":97},"2002-01-07","2002-01-08",null,"n"]
[{"$nulls":99},"2002-01-07","2002-01-08",null,"n"]
[{"$nulls":101},"2002-01-07","2002-01-08",null,"n"]
[{"$nulls":103},"2002-01-07","2002-01-08",null,"n"]
[{"$nulls":105},"2002-01-07","2002-01-08",null,"n"]
[{"$nulls":107},"2002-01-07","2002-01-08",null,"n"]
[{"$nulls":109},"2002-01-07","2002-01-08",null,"n"]
[{"$nulls":111},"2002-01-07","2002-01-08",null,"n"]
[{"$nulls":113},"2002-01-07","2002-01-08",null,"n"]
[{"$nulls":115},"2002-01-07","2002-01-08",null,"n"]
[{"$nulls":117},"2002-01-07","2002-01-08",null,"n"]
[{"$nulls":119},"2002-01-07","2002-01-08",null,"n"]
[{"$nulls":121},"2002-01-07","2002-01-08",null,"n"]
[{"$nulls":123},"2002-01-07","2002-01-08",null,"n"]
[{"$nulls":125},"2002-01-07","2002-01-08",null,"n"]
[{"$nulls":127},"2002-01-07","2002-01-08",null,"n"]
[{"$nulls":129},"2002-01-07","2002-01-08",null,"n"]
[{"$nulls":131},"2002-01-07","2002-01-08",null,"n"]
[{"$nulls":133},"2002-01-07","2002-01-08",null,"n"]
[{"$nulls":135},"2002-01-07","2002-01-08",null,"n"]
[{"$nulls":137},"2002-01-07","2002-01-08",null,"n"]
[{"$nulls":139},"2002-01-07","2002-01-08",null,"n"]
[{"$nulls":141},"2002-01-07","2002-01-08",null,"n"]
[{"$nulls":143},"2002-01-07","2002-01-08",null,"n"]
[{"$nulls":145},"2002-01-07","2002-01-08",null,"n"]
[{"$nulls":147},"2002-01-07","2002-01-08",null,"n"]
[{"$nulls":149},"2002-01-07","2002-01-08",null,"n"]
[{"$nulls":151},"2002-01-07","2002-01-08",null,"n"]
[{"$nulls":153},"2002-01-07","2002-01-08",null,"n"]
[{"$nulls":155},"2002-01-07","2002-01-08",null,"n"]
[{"$nulls":157},"2002-01-07","2002-01-08",null,"n"]
[{"$nulls":159},"2002-01-07","2002-01-08",null,"n"]
[{"$nulls":161},"2002-01-07","2002-01-08",null,"n"]
[{"$nulls":163},"2002-01-07","2002-01-08",null,"n"]
[{"$nulls":165},"2002-01-07","2002-01-08",null,"n"]
[{"$nulls":167},"2002-01-07","2002-01-08",null,"n"]
[{"$nulls":169},"2002-01-07","2002-01-08",null,"n"]
[{"$nulls":171},"2002-01-07","2002-01-08",null,"n"]
[{"$nulls":173},"2002-01-07","2002-01-08",null,"n"]
[{"$nulls":175},"2002-01-07","2002-01-08",null,"n"]
[{"$nulls":177},"2002-01-07","2002-01-08",null,"n"]
[{"$nulls":179},"2002-01-07","2002-01-08",null,"n"]
[{"$nulls":181},"2002-01-07","2002-01-08",null,"n"]
[{"$nulls":183},"2002-01-07","2002-01-08",null,"n"]
[{"$nulls":185},"2002-01-07","2002-01-08",null,"n"]
[{"$nulls":187},"2002-01-07","2002-01-08",null,"n"]
[{"$nulls":189},"2002-01-07","2002-01-08",null,"n"]
[{"$nulls":191},"2002-01-07","2002-01-08",null,"n"]
[{"$nulls":193},"2002-01-07","2002-01-08",null,"n"]
[{"$nulls":195},"2002-01-07","2002-01-08",null,"n"]
[{"$nulls":197},"2002-01-07","2002-01-08",null,"n"]
[{"$nulls":199},"2002-01-07","2002-01-08",null,"n"]
[{"$nulls":201},"2002-01-07","2002-01-08",null,"n"]
[{"$nulls":203},"2002-01-07","2002-01-08",null,"n"]
[{"$nulls":205},"2002-01-07","2002-01-08",null,"n"]
[{"$nulls":207},"2002-01-07","2002-01-08",null,"n"]
[{"$nulls":209},"2002-01-07","2002-01-08",null,"n"]
[{"$nulls":211},"2002-01-07","2002-01-08",null,"n"]
[{"$nulls":213},"2002-01-07","2002-01-08",null,"n"]
[{"$nulls":215},"2002-01-07","2002-01-08",null,"n"]
[{"$nulls":217},"2002-01-07","2002-01-08",null,"n"]
[{"$nulls":219},"2002-01-07","2002-01-08",null,"n"]
[{"$nulls":221},"2002-01-07","2002-01-08",null,"n"]
[{"$nulls":223},"2002-01-07","2002-01-08",null,"n"]
[{"$nulls":225},"2002-01-07","2002-01-08",null,"n"]

{"sheet":"F_Bernier","index":7,"n_rows":117,"n_cols":229,"rows_kept":117}
[]
[]
[null,null,{"$f":"NOW()","v":"2018-01-21T12:58:21.490"}]
[]
[null,null,"Nom","Bernier"]
[]
[{"$nulls":4},"Congés","Maladie","Maternité","Evnt. Familial","Congé Parental","Absence non rému.","Congé Paternité","Demi-journée"]
[null,null,"Date début","Date fin","CP","Mal","Mat","Evf","Cpa","AbsNR","Cpat","Dj"]
[null,null,"2018-01-02","2018-01-15",{"$nulls":3},10]
[null,null,"2018-01-22","2018-01-24",{"$nulls":5},3]
{"$rows_empty":14}
[{"$nulls":4},{"$f":"SUM(E9:E24)","v":0},0,0,10,0,3,0,0]
{"$rows_empty":12}
[{"$nulls":70},"n"]
[{"$nulls":69},"2002-01-07","2002-01-08",null,"n"]
[{"$nulls":71},"2002-01-07","2002-01-08",null,"n"]
[{"$nulls":73},"2002-01-07","2002-01-08",null,"n"]
[{"$nulls":75},"2002-01-07","2002-01-08",null,"n"]
[{"$nulls":77},"2002-01-07","2002-01-08",null,"n"]
[{"$nulls":79},"2002-01-07","2002-01-08",null,"n"]
[{"$nulls":81},"2002-01-07","2002-01-08",null,"n"]
[{"$nulls":83},"2002-01-07","2002-01-08",null,"n"]
[{"$nulls":85},"2002-01-07","2002-01-08",null,"n"]
[{"$nulls":87},"2002-01-07","2002-01-08",null,"n"]
[{"$nulls":89},"2002-01-07","2002-01-08",null,"n"]
[{"$nulls":91},"2002-01-07","2002-01-08",null,"n"]
[{"$nulls":93},"2002-01-07","2002-01-08",null,"n"]
[{"$nulls":95},"2002-01-07","2002-01-08",null,"n"]
[{"$nulls":97},"2002-01-07","2002-01-08",null,"n"]
[{"$nulls":99},"2002-01-07","2002-01-08",null,"n"]
[{"$nulls":101},"2002-01-07","2002-01-08",null,"n"]
[{"$nulls":103},"2002-01-07","2002-01-08",null,"n"]
[{"$nulls":105},"2002-01-07","2002-01-08",null,"n"]
[{"$nulls":107},"2002-01-07","2002-01-08",null,"n"]
[{"$nulls":109},"2002-01-07","2002-01-08",null,"n"]
[{"$nulls":111},"2002-01-07","2002-01-08",null,"n"]
[{"$nulls":113},"2002-01-07","2002-01-08",null,"n"]
[{"$nulls":115},"2002-01-07","2002-01-08",null,"n"]
[{"$nulls":117},"2002-01-07","2002-01-08",null,"n"]
[{"$nulls":119},"2002-01-07","2002-01-08",null,"n"]
[{"$nulls":121},"2002-01-07","2002-01-08",null,"n"]
[{"$nulls":123},"2002-01-07","2002-01-08",null,"n"]
[{"$nulls":125},"2002-01-07","2002-01-08",null,"n"]
[{"$nulls":127},"2002-01-07","2002-01-08",null,"n"]
[{"$nulls":129},"2002-01-07","2002-01-08",null,"n"]
[{"$nulls":131},"2002-01-07","2002-01-08",null,"n"]
[{"$nulls":133},"2002-01-07","2002-01-08",null,"n"]
[{"$nulls":135},"2002-01-07","2002-01-08",null,"n"]
[{"$nulls":137},"2002-01-07","2002-01-08",null,"n"]
[{"$nulls":139},"2002-01-07","2002-01-08",null,"n"]
[{"$nulls":141},"2002-01-07","2002-01-08",null,"n"]
[{"$nulls":143},"2002-01-07","2002-01-08",null,"n"]
[{"$nulls":145},"2002-01-07","2002-01-08",null,"n"]
[{"$nulls":147},"2002-01-07","2002-01-08",null,"n"]
[{"$nulls":149},"2002-01-07","2002-01-08",null,"n"]
[{"$nulls":151},"2002-01-07","2002-01-08",null,"n"]
[{"$nulls":153},"2002-01-07","2002-01-08",null,"n"]
[{"$nulls":155},"2002-01-07","2002-01-08",null,"n"]
[{"$nulls":157},"2002-01-07","2002-01-08",null,"n"]
[{"$nulls":159},"2002-01-07","2002-01-08",null,"n"]
[{"$nulls":161},"2002-01-07","2002-01-08",null,"n"]
[{"$nulls":163},"2002-01-07","2002-01-08",null,"n"]
[{"$nulls":165},"2002-01-07","2002-01-08",null,"n"]
[{"$nulls":167},"2002-01-07","2002-01-08",null,"n"]
[{"$nulls":169},"2002-01-07","2002-01-08",null,"n"]
[{"$nulls":171},"2002-01-07","2002-01-08",null,"n"]
[{"$nulls":173},"2002-01-07","2002-01-08",null,"n"]
[{"$nulls":175},"2002-01-07","2002-01-08",null,"n"]
[{"$nulls":177},"2002-01-07","2002-01-08",null,"n"]
[{"$nulls":179},"2002-01-07","2002-01-08",null,"n"]
[{"$nulls":181},"2002-01-07","2002-01-08",null,"n"]
[{"$nulls":183},"2002-01-07","2002-01-08",null,"n"]
[{"$nulls":185},"2002-01-07","2002-01-08",null,"n"]
[{"$nulls":187},"2002-01-07","2002-01-08",null,"n"]
[{"$nulls":189},"2002-01-07","2002-01-08",null,"n"]
[{"$nulls":191},"2002-01-07","2002-01-08",null,"n"]
[{"$nulls":193},"2002-01-07","2002-01-08",null,"n"]
[{"$nulls":195},"2002-01-07","2002-01-08",null,"n"]
[{"$nulls":197},"2002-01-07","2002-01-08",null,"n"]
[{"$nulls":199},"2002-01-07","2002-01-08",null,"n"]
[{"$nulls":201},"2002-01-07","2002-01-08",null,"n"]
[{"$nulls":203},"2002-01-07","2002-01-08",null,"n"]
[{"$nulls":205},"2002-01-07","2002-01-08",null,"n"]
[{"$nulls":207},"2002-01-07","2002-01-08",null,"n"]
[{"$nulls":209},"2002-01-07","2002-01-08",null,"n"]
[{"$nulls":211},"2002-01-07","2002-01-08",null,"n"]
[{"$nulls":213},"2002-01-07","2002-01-08",null,"n"]
[{"$nulls":215},"2002-01-07","2002-01-08",null,"n"]
[{"$nulls":217},"2002-01-07","2002-01-08",null,"n"]
[{"$nulls":219},"2002-01-07","2002-01-08",null,"n"]
[{"$nulls":221},"2002-01-07","2002-01-08",null,"n"]
[{"$nulls":223},"2002-01-07","2002-01-08",null,"n"]
[{"$nulls":225},"2002-01-07","2002-01-08",null,"n"]

{"sheet":"F_Dupond","index":8,"n_rows":117,"n_cols":229,"rows_kept":117}
[]
[]
[null,null,{"$f":"NOW()","v":"2018-01-21T12:58:21.490"}]
[]
[null,null,"Nom","Dupond"]
[]
[{"$nulls":4},"Congés","Maladie","Maternité","Evnt. Familial","Congé Parental","Absence non rému.","Congé Paternité","Demi-journée"]
[null,null,"Date début","Date fin","CP","Mal","Mat","Evf","Cpa","AbsNR","Cpat","Dj"]
[null,null,"2018-01-04","2018-01-10",null,null,5]
{"$rows_empty":15}
[{"$nulls":4},{"$f":"SUM(E9:E24)","v":0},0,5,0,0,0,0,0]
{"$rows_empty":12}
[{"$nulls":70},"n"]
[{"$nulls":69},"2002-01-07","2002-01-08",null,"n"]
[{"$nulls":71},"2002-01-07","2002-01-08",null,"n"]
[{"$nulls":73},"2002-01-07","2002-01-08",null,"n"]
[{"$nulls":75},"2002-01-07","2002-01-08",null,"n"]
[{"$nulls":77},"2002-01-07","2002-01-08",null,"n"]
[{"$nulls":79},"2002-01-07","2002-01-08",null,"n"]
[{"$nulls":81},"2002-01-07","2002-01-08",null,"n"]
[{"$nulls":83},"2002-01-07","2002-01-08",null,"n"]
[{"$nulls":85},"2002-01-07","2002-01-08",null,"n"]
[{"$nulls":87},"2002-01-07","2002-01-08",null,"n"]
[{"$nulls":89},"2002-01-07","2002-01-08",null,"n"]
[{"$nulls":91},"2002-01-07","2002-01-08",null,"n"]
[{"$nulls":93},"2002-01-07","2002-01-08",null,"n"]
[{"$nulls":95},"2002-01-07","2002-01-08",null,"n"]
[{"$nulls":97},"2002-01-07","2002-01-08",null,"n"]
[{"$nulls":99},"2002-01-07","2002-01-08",null,"n"]
[{"$nulls":101},"2002-01-07","2002-01-08",null,"n"]
[{"$nulls":103},"2002-01-07","2002-01-08",null,"n"]
[{"$nulls":105},"2002-01-07","2002-01-08",null,"n"]
[{"$nulls":107},"2002-01-07","2002-01-08",null,"n"]
[{"$nulls":109},"2002-01-07","2002-01-08",null,"n"]
[{"$nulls":111},"2002-01-07","2002-01-08",null,"n"]
[{"$nulls":113},"2002-01-07","2002-01-08",null,"n"]
[{"$nulls":115},"2002-01-07","2002-01-08",null,"n"]
[{"$nulls":117},"2002-01-07","2002-01-08",null,"n"]
[{"$nulls":119},"2002-01-07","2002-01-08",null,"n"]
[{"$nulls":121},"2002-01-07","2002-01-08",null,"n"]
[{"$nulls":123},"2002-01-07","2002-01-08",null,"n"]
[{"$nulls":125},"2002-01-07","2002-01-08",null,"n"]
[{"$nulls":127},"2002-01-07","2002-01-08",null,"n"]
[{"$nulls":129},"2002-01-07","2002-01-08",null,"n"]
[{"$nulls":131},"2002-01-07","2002-01-08",null,"n"]
[{"$nulls":133},"2002-01-07","2002-01-08",null,"n"]
[{"$nulls":135},"2002-01-07","2002-01-08",null,"n"]
[{"$nulls":137},"2002-01-07","2002-01-08",null,"n"]
[{"$nulls":139},"2002-01-07","2002-01-08",null,"n"]
[{"$nulls":141},"2002-01-07","2002-01-08",null,"n"]
[{"$nulls":143},"2002-01-07","2002-01-08",null,"n"]
[{"$nulls":145},"2002-01-07","2002-01-08",null,"n"]
[{"$nulls":147},"2002-01-07","2002-01-08",null,"n"]
[{"$nulls":149},"2002-01-07","2002-01-08",null,"n"]
[{"$nulls":151},"2002-01-07","2002-01-08",null,"n"]
[{"$nulls":153},"2002-01-07","2002-01-08",null,"n"]
[{"$nulls":155},"2002-01-07","2002-01-08",null,"n"]
[{"$nulls":157},"2002-01-07","2002-01-08",null,"n"]
[{"$nulls":159},"2002-01-07","2002-01-08",null,"n"]
[{"$nulls":161},"2002-01-07","2002-01-08",null,"n"]
[{"$nulls":163},"2002-01-07","2002-01-08",null,"n"]
[{"$nulls":165},"2002-01-07","2002-01-08",null,"n"]
[{"$nulls":167},"2002-01-07","2002-01-08",null,"n"]
[{"$nulls":169},"2002-01-07","2002-01-08",null,"n"]
[{"$nulls":171},"2002-01-07","2002-01-08",null,"n"]
[{"$nulls":173},"2002-01-07","2002-01-08",null,"n"]
[{"$nulls":175},"2002-01-07","2002-01-08",null,"n"]
[{"$nulls":177},"2002-01-07","2002-01-08",null,"n"]
[{"$nulls":179},"2002-01-07","2002-01-08",null,"n"]
[{"$nulls":181},"2002-01-07","2002-01-08",null,"n"]
[{"$nulls":183},"2002-01-07","2002-01-08",null,"n"]
[{"$nulls":185},"2002-01-07","2002-01-08",null,"n"]
[{"$nulls":187},"2002-01-07","2002-01-08",null,"n"]
[{"$nulls":189},"2002-01-07","2002-01-08",null,"n"]
[{"$nulls":191},"2002-01-07","2002-01-08",null,"n"]
[{"$nulls":193},"2002-01-07","2002-01-08",null,"n"]
[{"$nulls":195},"2002-01-07","2002-01-08",null,"n"]
[{"$nulls":197},"2002-01-07","2002-01-08",null,"n"]
[{"$nulls":199},"2002-01-07","2002-01-08",null,"n"]
[{"$nulls":201},"2002-01-07","2002-01-08",null,"n"]
[{"$nulls":203},"2002-01-07","2002-01-08",null,"n"]
[{"$nulls":205},"2002-01-07","2002-01-08",null,"n"]
[{"$nulls":207},"2002-01-07","2002-01-08",null,"n"]
[{"$nulls":209},"2002-01-07","2002-01-08",null,"n"]
[{"$nulls":211},"2002-01-07","2002-01-08",null,"n"]
[{"$nulls":213},"2002-01-07","2002-01-08",null,"n"]
[{"$nulls":215},"2002-01-07","2002-01-08",null,"n"]
[{"$nulls":217},"2002-01-07","2002-01-08",null,"n"]
[{"$nulls":219},"2002-01-07","2002-01-08",null,"n"]
[{"$nulls":221},"2002-01-07","2002-01-08",null,"n"]
[{"$nulls":223},"2002-01-07","2002-01-08",null,"n"]
[{"$nulls":225},"2002-01-07","2002-01-08",null,"n"]