{"text_format":"3","workbook":"xlsx","n_sheets":10,"sheets":["BD","Plan","Fériés","ParamètresCouleurs","Couleurs","modèle","F_Balu","F_Bernier","F_Bisson","F_Dupond"],"not_rendered":{"macros":1,"defined_names":7,"comments":1},"read":"whole","date_system":"1900"}

{"sheet":"BD","index":0,"n_rows":12,"n_cols":7,"rows_kept":12}
["Nom","Début","Fin","TypeCongés","Matin/AM","nb jours","Commentaire"]
["Balu","2019-01-01","2019-01-01","CP","M",0.5,"xx"]
["Balu","2019-01-01","2019-01-01","Mat","A",0.5,"yy"]
["Balu","2019-01-07","2019-01-11","CP","MAM",5]
["Balu","2019-01-15","2019-01-18","CP","MAM",4]
["Balu","2019-01-21","2019-01-25","Cpa","MAM",5]
["Dupond","2019-01-01","2019-01-01","CP","A",0.5]
["Dupond","2019-01-07","2019-01-08","Cpa","MAM",2,"kk"]
["Dupond","2019-01-17","2019-01-18","Mal","MAM",2,"blabla"]
["Bernier","2019-01-02","2019-01-02","CP","M",0.5,"zz"]
["Bisson","2019-01-01","2019-01-04","CP","MAM",4,"vv"]
["Bisson","2019-01-08","2019-01-08","CP","A",0.5,"pp"]

{"sheet":"Plan","index":1,"n_rows":24,"n_cols":739,"rows_kept":24}
[null,{"$f":"DATE(Année,1,1)","v":"2019-01-01"},{"$f":"IF(MONTH(B3)<>MONTH(C3),TEXT(C3,\"mmmm aa\"),\"\")","v":""},"","","","","","","","","","","","","","","","","","","","","","","","","","","","","","","","","","","","","","","","","","","","","","","","","","","","","","","","","","","","","février 19",{"$f":"IF(MONTH(BL3)<>MONTH(BM3),TEXT(BM3,\"mmmm aa\"),\"\")","v":""},{"$f":"IF(MONTH(BM3)<>MONTH(BN3),TEXT(BN3,\"mmmm aa\"),\"\")","v":""},{"$f":"IF(MONTH(BN3)<>MONTH(BO3),TEXT(BO3,\"mmmm aa\"),\"\")","v":""},{"$f":"IF(MONTH(BO3)<>MONTH(BP3),TEXT(BP3,\"mmmm aa\"),\"\")","v":""},{"$f":"IF(MONTH(BP3)<>MONTH(BQ3),TEXT(BQ3,\"mmmm aa\"),\"\")","v":""},{"$f":"IF(MONTH(BQ3)<>MONTH(BR3),TEXT(BR3,\"mmmm aa\"),\"\")","v":""},{"$f":"IF(MONTH(BR3)<>MONTH(BS3),TEXT(BS3,\"mmmm aa\"),\"\")","v":""},{"$f":"IF(MONTH(BS3)<>MONTH(BT3),TEXT(BT3,\"mmmm aa\"),\"\")","v":""},{"$f":"IF(MONTH(BT3)<>MONTH(BU3),TEXT(BU3,\"mmmm aa\"),\"\")","v":""},{"$f":"IF(MONTH(BU3)<>MONTH(BV3),TEXT(BV3,\"mmmm aa\"),\"\")","v":""},{"$f":"IF(MONTH(BV3)<>MONTH(BW3),TEXT(BW3,\"mmmm aa\"),\"\")","v":""},{"$f":"IF(MONTH(BW3)<>MONTH(BX3),TEXT(BX3,\"mmmm aa\"),\"\")","v":""},{"$f":"IF(MONTH(BX3)<>MONTH(BY3),TEXT(BY3,\"mmmm aa\"),\"\")","v":""},{"$f":"IF(MONTH(BY3)<>MONTH(BZ3),TEXT(BZ3,\"mmmm aa\"),\"\")","v":""},{"$f":"IF(MONTH(BZ3)<>MONTH(CA3),TEXT(CA3,\"mmmm aa\"),\"\")","v":""},{"$f":"IF(MONTH(CA3)<>MONTH(CB3),TEXT(CB3,\"mmmm aa\"),\"\")","v":""},{"$f":"IF(MONTH(CB3)<>MONTH(CC3),TEXT(CC3,\"mmmm aa\"),\"\")","v":""},{"$f":"IF(MONTH(CC3)<>MONTH(CD3),TEXT(CD3,\"mmmm aa\"),\"\")","v":""},{"$f":"IF(MONTH(CD3)<>MONTH(CE3),TEXT(CE3,\"mmmm aa\"),\"\")","v":""},{"$f":"IF(MONTH(CE3)<>MONTH(CF3),TEXT(CF3,\"mmmm aa\"),\"\")","v":""},{"$f":"IF(MONTH(CF3)<>MONTH(CG3),TEXT(CG3,\"mmmm aa\"),\"\")","v":""},{"$f":"IF(MONTH(CG3)<>MONTH(CH3),TEXT(CH3,\"mmmm aa\"),\"\")","v":""},{"$f":"IF(MONTH(CH3)<>MONTH(CI3),TEXT(CI3,\"mmmm aa\"),\"\")","v":""},{"$f":"IF(MONTH(CI3)<>MONTH(CJ3),TEXT(CJ3,\"mmmm aa\"),\"\")","v":""},{"$f":"IF(MONTH(CJ3)<>MONTH(CK3),TEXT(CK3,\"mmmm aa\"),\"\")","v":""},{"$f":"IF(MONTH(CK3)<>MONTH(CL3),TEXT(CL3,\"mmmm aa\"),\"\")","v":""},{"$f":"IF(MONTH(CL3)<>MONTH(CM3),TEXT(CM3,\"mmmm aa\"),\"\")","v":""},{"$f":"IF(MONTH(CM3)<>MONTH(CN3),TEXT(CN3,\"mmmm aa\"),\"\")","v":""},{"$f":"IF(MONTH(CN3)<>MONTH(CO3),TEXT(CO3,\"mmmm aa\"),\"\")","v":""},{"$f":"IF(MONTH(CO3)<>MONTH(CP3),TEXT(CP3,\"mmmm aa\"),\"\")","v":""},{"$f":"IF(MONTH(CP3)<>MONTH(CQ3),TEXT(CQ3,\"mmmm aa\"),\"\")","v":""},{"$f":"IF(MONTH(CQ3)<>MONTH(CR3),TEXT(CR3,\"mmmm aa\"),\"\")","v":""},{"$f":"IF(MONTH(CR3)<>MONTH(CS3),TEXT(CS3,\"mmmm aa\"),\"\")","v":""},{"$f":"IF(MONTH(CS3)<>MONTH(CT3),TEXT(CT3,\"mmmm aa\"),\"\")","v":""},{"$f":"IF(MONTH(CT3)<>MONTH(CU3),TEXT(CU3,\"mmmm aa\"),\"\")","v":""},{"$f":"IF(MONTH(CU3)<>MONTH(CV3),TEXT(CV3,\"mmmm aa\"),\"\")","v":""},{"$f":"IF(MONTH(CV3)<>MONTH(CW3),TEXT(CW3,\"mmmm aa\"),\"\")","v":""},{"$f":"IF(MONTH(CW3)<>MONTH(CX3),TEXT(CX3,\"mmmm aa\"),\"\")","v":""},{"$f":"IF(MONTH(CX3)<>MONTH(CY3),TEXT(CY3,\"mmmm aa\"),\"\")","v":""},{"$f":"IF(MONTH(CY3)<>MONTH(CZ3),TEXT(CZ3,\"mmmm aa\"),\"\")","v":""},{"$f":"IF(MONTH(CZ3)<>MONTH(DA3),TEXT(DA3,\"mmmm aa\"),\"\")","v":""},{"$f":"IF(MONTH(DA3)<>MONTH(DB3),TEXT(DB3,\"mmmm aa\"),\"\")","v":""},{"$f":"IF(MONTH(DB3)<>MONTH(DC3),TEXT(DC3,\"mmmm aa\"),\"\")","v":""},{"$f":"IF(MONTH(DC3)<>MONTH(DD3),TEXT(DD3,\"mmmm aa\"),\"\")","v":""},{"$f":"IF(MONTH(DD3)<>MONTH(DE3),TEXT(DE3,\"mmmm aa\"),\"\")","v":""},{"$f":"IF(MONTH(DE3)<>MONTH(DF3),TEXT(DF3,\"mmmm aa\"),\"\")","v":""},{"$f":"IF(MONTH(DF3)<>MONTH(DG3),TEXT(DG3,\"mmmm aa\"),\"\")","v":""},{"$f":"IF(MONTH(DG3)<>MONTH(DH3),TEXT(DH3,\"mmmm aa\"),\"\")","v":""},{"$f":"IF(MONTH(DH3)<>MONTH(DI3),TEXT(DI3,\"mmmm aa\"),\"\")","v":""},{"$f":"IF(MONTH(DI3)<>MONTH(DJ3),TEXT(DJ3,\"mmmm aa\"),\"\")","v":""},{"$f":"IF(MONTH(DJ3)<>MONTH(DK3),TEXT(DK3,\"mmmm aa\"),\"\")","v":""},{"$f":"IF(MONTH(DK3)<>MONTH(DL3),TEXT(DL3,\"mmmm aa\"),\"\")","v":""},{"$f":"IF(MONTH(DL3)<>MONTH(DM3),TEXT(DM3,\"mmmm aa\"),\"\")","v":""},{"$f":"IF(MONTH(DM3)<>MONTH(DN3),TEXT(DN3,\"mmmm aa\"),\"\")","v":""},{"$f":"IF(MONTH(DN3)<>MONTH(DO3),TEXT(DO3,\"mmmm aa\"),\"\")","v":""},{"$f":"IF(MONTH(DO3)<>MONTH(DP3),TEXT(DP3,\"mmmm aa\"),\"\")","v":"mars 19"},{"$f":"IF(MONTH(DP3)<>MONTH(DQ3),TEXT(DQ3,\"mmmm aa\"),\"\")","v":""},{"$f":"IF(MONTH(DQ3)<>MONTH(DR3),TEXT(DR3,\"mmmm aa\"),\"\")","v":""},{"$f":"IF(MONTH(DR3)<>MONTH(DS3),TEXT(DS3,\"mmmm aa\"),\"\")","v":""},{"$f":"IF(MONTH(DS3)<>MONTH(DT3),TEXT(DT3,\"mmmm aa\"),\"\")","v":""},{"$f":"IF(MONTH(DT3)<>MONTH(DU3),TEXT(DU3,\"mmmm aa\"),\"\")","v":""},{"$f":"IF(MONTH(DU3)<>MONTH(DV3),TEXT(DV3,\"mmmm aa\"),\"\")","v":""},{"$f":"IF(MONTH(DV3)<>MONTH(DW3),TEXT(DW3,\"mmmm aa\"),\"\")","v":""},{"$f":"IF(MONTH(DW3)<>MONTH(DX3),TEXT(DX3,\"mmmm aa\"),\"\")","v":""},{"$f":"IF(MONTH(DX3)<>MONTH(DY3),TEXT(DY3,\"mmmm aa\"),\"\")","v":""},{"$f":"IF(MONTH(DY3)<>MONTH(DZ3),TEXT(DZ3,\"mmmm aa\"),\"\")","v":""},{"$f":"IF(MONTH(DZ3)<>MONTH(EA3),TEXT(EA3,\"mmmm aa\"),\"\")","v":""},{"$f":"IF(MONTH(EA3)<>MONTH(EB3),TEXT(EB3,\"mmmm aa\"),\"\")","v":""},{"$f":"IF(MONTH(EB3)<>MONTH(EC3),TEXT(EC3,\"mmmm aa\"),\"\")","v":""},{"$f":"IF(MONTH(EC3)<>MONTH(ED3),TEXT(ED3,\"mmmm aa\"),\"\")","v":""},{"$f":"IF(MONTH(ED3)<>MONTH(EE3),TEXT(EE3,\"mmmm aa\"),\"\")","v":""},{"$f":"IF(MONTH(EE3)<>MONTH(EF3),TEXT(EF3,\"mmmm aa\"),\"\")","v":""},{"$f":"IF(MONTH(EF3)<>MONTH(EG3),TEXT(EG3,\"mmmm aa\"),\"\")","v":""},{"$f":"IF(MONTH(EG3)<>MONTH(EH3),TEXT(EH3,\"mmmm aa\"),\"\")","v":""},{"$f":"IF(MONTH(EH3)<>MONTH(EI3),TEXT(EI3,\"mmmm aa\"),\"\")","v":""},{"$f":"IF(MONTH(EI3)<>MONTH(EJ3),TEXT(EJ3,\"mmmm aa\"),\"\")","v":""},{"$f":"IF(MONTH(EJ3)<>MONTH(EK3),TEXT(EK3,\"mmmm aa\"),\"\")","v":""},{"$f":"IF(MONTH(EK3)<>MONTH(EL3),TEXT(EL3,\"mmmm aa\"),\"\")","v":""},{"$f":"IF(MONTH(EL3)<>MONTH(EM3),TEXT(EM3,\"mmmm aa\"),\"\")","v":""},{"$f":"IF(MONTH(EM3)<>MONTH(EN3),TEXT(EN3,\"mmmm aa\"),\"\")","v":""},{"$f":"IF(MONTH(EN3)<>MONTH(EO3),TEXT(EO3,\"mmmm aa\"),\"\")","v":""},{"$f":"IF(MONTH(EO3)<>MONTH(EP3),TEXT(EP3,\"mmmm aa\"),\"\")","v":""},{"$f":"IF(MONTH(EP3)<>MONTH(EQ3),TEXT(EQ3,\"mmmm aa\"),\"\")","v":""},{"$f":"IF(MONTH(EQ3)<>MONTH(ER3),TEXT(ER3,\"mmmm aa\"),\"\")","v":""},{"$f":"IF(MONTH(ER3)<>MONTH(ES3),TEXT(ES3,\"mmmm aa\"),\"\")","v":""},{"$f":"IF(MONTH(ES3)<>MONTH(ET3),TEXT(ET3,\"mmmm aa\"),\"\")","v":""},{"$f":"IF(MONTH(ET3)<>MONTH(EU3),TEXT(EU3,\"mmmm aa\"),\"\")","v":""},{"$f":"IF(MONTH(EU3)<>MONTH(EV3),TEXT(EV3,\"mmmm aa\"),\"\")","v":""},{"$f":"IF(MONTH(EV3)<>MONTH(EW3),TEXT(EW3,\"mmmm aa\"),\"\")","v":""},{"$f":"IF(MONTH(EW3)<>MONTH(EX3),TEXT(EX3,\"mmmm aa\"),\"\")","v":""},{"$f":"IF(MONTH(EX3)<>MONTH(EY3),TEXT(EY3,\"mmmm aa\"),\"\")","v":""},{"$f":"IF(MONTH(EY3)<>MONTH(EZ3),TEXT(EZ3,\"mmmm aa\"),\"\")","v":""},{"$f":"IF(MONTH(EZ3)<>MONTH(FA3),TEXT(FA3,\"mmmm aa\"),\"\")","v":""},{"$f":"IF(MONTH(FA3)<>MONTH(FB3),TEXT(FB3,\"mmmm aa\"),\"\")","v":""},{"$f":"IF(MONTH(FB3)<>MONTH(FC3),TEXT(FC3,\"mmmm aa\"),\"\")","v":""},{"$f":"IF(MONTH(FC3)<>MONTH(FD3),TEXT(FD3,\"mmmm aa\"),\"\")","v":""},{"$f":"IF(MONTH(FD3)<>MONTH(FE3),TEXT(FE3,\"mmmm aa\"),\"\")","v":""},{"$f":"IF(MONTH(FE3)<>MONTH(FF3),TEXT(FF3,\"mmmm aa\"),\"\")","v":""},{"$f":"IF(MONTH(FF3)<>MONTH(FG3),TEXT(FG3,\"mmmm aa\"),\"\")","v":""},{"$f":"IF(MONTH(FG3)<>MONTH(FH3),TEXT(FH3,\"mmmm aa\"),\"\")","v":""},{"$f":"IF(MONTH(FH3)<>MONTH(FI3),TEXT(FI3,\"mmmm aa\"),\"\")","v":""},{"$f":"IF(MONTH(FI3)<>MONTH(FJ3),TEXT(FJ3,\"mmmm aa\"),\"\")","v":""},{"$f":"IF(MONTH(FJ3)<>MONTH(FK3),TEXT(FK3,\"mmmm aa\"),\"\")","v":""},{"$f":"IF(MONTH(FK3)<>MONTH(FL3),TEXT(FL3,\"mmmm aa\"),\"\")","v":""},{"$f":"IF(MONTH(FL3)<>MONTH(FM3),TEXT(FM3,\"mmmm aa\"),\"\")","v":""},{"$f":"IF(MONTH(FM3)<>MONTH(FN3),TEXT(FN3,\"mmmm aa\"),\"\")","v":""},{"$f":"IF(MONTH(FN3)<>MONTH(FO3),TEXT(FO3,\"mmmm aa\"),\"\")","v":""},{"$f":"IF(MONTH(FO3)<>MONTH(FP3),TEXT(FP3,\"mmmm aa\"),\"\")","v":""},{"$f":"IF(MONTH(FP3)<>MONTH(FQ3),TEXT(FQ3,\"mmmm aa\"),\"\")","v":""},{"$f":"IF(MONTH(FQ3)<>MONTH(FR3),TEXT(FR3,\"mmmm aa\"),\"\")","v":""},{"$f":"IF(MONTH(FR3)<>MONTH(FS3),TEXT(FS3,\"mmmm aa\"),\"\")","v":""},{"$f":"IF(MONTH(FS3)<>MONTH(FT3),TEXT(FT3,\"mmmm aa\"),\"\")","v":""},{"$f":"IF(MONTH(FT3)<>MONTH(FU3),TEXT(FU3,\"mmmm aa\"),\"\")","v":""},{"$f":"IF(MONTH(FU3)<>MONTH(FV3),TEXT(FV3,\"mmmm aa\"),\"\")","v":""},{"$f":"IF(MONTH(FV3)<>MONTH(FW3),TEXT(FW3,\"mmmm aa\"),\"\")","v":""},{"$f":"IF(MONTH(FW3)<>MONTH(FX3),TEXT(FX3,\"mmmm aa\"),\"\")","v":""},{"$f":"IF(MONTH(FX3)<>MONTH(FY3),TEXT(FY3,\"mmmm aa\"),\"\")","v":""},{"$f":"IF(MONTH(FY3)<>MONTH(FZ3),TEXT(FZ3,\"mmmm aa\"),\"\")","v":"avril 19"},{"$f":"IF(MONTH(FZ3)<>MONTH(GA3),TEXT(GA3,\"mmmm aa\"),\"\")","v":""},{"$f":"IF(MONTH(GA3)<>MONTH(GB3),TEXT(GB3,\"mmmm aa\"),\"\")","v":""},{"$f":"IF(MONTH(GB3)<>MONTH(GC3),TEXT(GC3,\"mmmm aa\"),\"\")","v":""},{"$f":"IF(MONTH(GC3)<>MONTH(GD3),TEXT(GD3,\"mmmm aa\"),\"\")","v":""},{"$f":"IF(MONTH(GD3)<>MONTH(GE3),TEXT(GE3,\"mmmm aa\"),\"\")","v":""},{"$f":"IF(MONTH(GE3)<>MONTH(GF3),TEXT(GF3,\"mmmm aa\"),\"\")","v":""},{"$f":"IF(MONTH(GF3)<>MONTH(GG3),TEXT(GG3,\"mmmm aa\"),\"\")","v":""},{"$f":"IF(MONTH(GG3)<>MONTH(GH3),TEXT(GH3,\"mmmm aa\"),\"\")","v":""},{"$f":"IF(MONTH(GH3)<>MONTH(GI3),TEXT(GI3,\"mmmm aa\"),\"\")","v":""},{"$f":"IF(MONTH(GI3)<>MONTH(GJ3),TEXT(GJ3,\"mmmm aa\"),\"\")","v":""},{"$f":"IF(MONTH(GJ3)<>MONTH(GK3),TEXT(GK3,\"mmmm aa\"),\"\")","v":""},{"$f":"IF(MONTH(GK3)<>MONTH(GL3),TEXT(GL3,\"mmmm aa\"),\"\")","v":""},{"$f":"IF(MONTH(GL3)<>MONTH(GM3),TEXT(GM3,\"mmmm aa\"),\"\")","v":""},{"$f":"IF(MONTH(GM3)<>MONTH(GN3),TEXT(GN3,\"mmmm aa\"),\"\")","v":""},{"$f":"IF(MONTH(GN3)<>MONTH(GO3),TEXT(GO3,\"mmmm aa\"),\"\")","v":""},{"$f":"IF(MONTH(GO3)<>MONTH(GP3),TEXT(GP3,\"mmmm aa\"),\"\")","v":""},{"$f":"IF(MONTH(GP3)<>MONTH(GQ3),TEXT(GQ3,\"mmmm aa\"),\"\")","v":""},{"$f":"IF(MONTH(GQ3)<>MONTH(GR3),TEXT(GR3,\"mmmm aa\"),\"\")","v":""},{"$f":"IF(MONTH(GR3)<>MONTH(GS3),TEXT(GS3,\"mmmm aa\"),\"\")","v":""},{"$f":"IF(MONTH(GS3)<>MONTH(GT3),TEXT(GT3,\"mmmm aa\"),\"\")","v":""},{"$f":"IF(MONTH(GT3)<>MONTH(GU3),TEXT(GU3,\"mmmm aa\"),\"\")","v":""},{"$f":"IF(MONTH(GU3)<>MONTH(GV3),TEXT(GV3,\"mmmm aa\"),\"\")","v":""},{"$f":"IF(MONTH(GV3)<>MONTH(GW3),TEXT(GW3,\"mmmm aa\"),\"\")","v":""},{"$f":"IF(MONTH(GW3)<>MONTH(GX3),TEXT(GX3,\"mmmm aa\"),\"\")","v":""},{"$f":"IF(MONTH(GX3)<>MONTH(GY3),TEXT(GY3,\"mmmm aa\"),\"\")","v":""},{"$f":"IF(MONTH(GY3)<>MONTH(GZ3),TEXT(GZ3,\"mmmm aa\"),\"\")","v":""},{"$f":"IF(MONTH(GZ3)<>MONTH(HA3),TEXT(HA3,\"mmmm aa\"),\"\")","v":""},{"$f":"IF(MONTH(HA3)<>MONTH(HB3),TEXT(HB3,\"mmmm aa\"),\"\")","v":""},{"$f":"IF(MONTH(HB3)<>MONTH(HC3),TEXT(HC3,\"mmmm aa\"),\"\")","v":""},{"$f":"IF(MONTH(HC3)<>MONTH(HD3),TEXT(HD3,\"mmmm aa\"),\"\")","v":""},{"$f":"IF(MONTH(HD3)<>MONTH(HE3),TEXT(HE3,\"mmmm aa\"),\"\")","v":""},{"$f":"IF(MONTH(HE3)<>MONTH(HF3),TEXT(HF3,\"mmmm aa\"),\"\")","v":""},{"$f":"IF(MONTH(HF3)<>MONTH(HG3),TEXT(HG3,\"mmmm aa\"),\"\")","v":""},{"$f":"IF(MONTH(HG3)<>MONTH(HH3),TEXT(HH3,\"mmmm aa\"),\"\")","v":""},{"$f":"IF(MONTH(HH3)<>MONTH(HI3),TEXT(HI3,\"mmmm aa\"),\"\")","v":""},{"$f":"IF(MONTH(HI3)<>MONTH(HJ3),TEXT(HJ3,\"mmmm aa\"),\"\")","v":""},{"$f":"IF(MONTH(HJ3)<>MONTH(HK3),TEXT(HK3,\"mmmm aa\"),\"\")","v":""},{"$f":"IF(MONTH(HK3)<>MONTH(HL3),TEXT(HL3,\"mmmm aa\"),\"\")","v":""},{"$f":"IF(MONTH(HL3)<>MONTH(HM3),TEXT(HM3,\"mmmm aa\"),\"\")","v":""},{"$f":"IF(MONTH(HM3)<>MONTH(HN3),TEXT(HN3,\"mmmm aa\"),\"\")","v":""},{"$f":"IF(MONTH(HN3)<>MONTH(HO3),TEXT(HO3,\"mmmm aa\"),\"\")","v":""},{"$f":"IF(MONTH(HO3)<>MONTH(HP3),TEXT(HP3,\"mmmm aa\"),\"\")","v":""},{"$f":"IF(MONTH(HP3)<>MONTH(HQ3),TEXT(HQ3,\"mmmm aa\"),\"\")","v":""},{"$f":"IF(MONTH(HQ3)<>MONTH(HR3),TEXT(HR3,\"mmmm aa\"),\"\")","v":""},{"$f":"IF(MONTH(HR3)<>MONTH(HS3),TEXT(HS3,\"mmmm aa\"),\"\")","v":""},{"$f":"IF(MONTH(HS3)<>MONTH(HT3),TEXT(HT3,\"mmmm aa\"),\"\")","v":""},{"$f":"IF(MONTH(HT3)<>MONTH(HU3),TEXT(HU3,\"mmmm aa\"),\"\")","v":""},{"$f":"IF(MONTH(HU3)<>MONTH(HV3),TEXT(HV3,\"mmmm aa\"),\"\")","v":""},{"$f":"IF(MONTH(HV3)<>MONTH(HW3),TEXT(HW3,\"mmmm aa\"),\"\")","v":""},{"$f":"IF(MONTH(HW3)<>MONTH(HX3),TEXT(HX3,\"mmmm aa\"),\"\")","v":""},{"$f":"IF(MONTH(HX3)<>MONTH(HY3),TEXT(HY3,\"mmmm aa\"),\"\")","v":""},{"$f":"IF(MONTH(HY3)<>MONTH(HZ3),TEXT(HZ3,\"mmmm aa\"),\"\")","v":""},{"$f":"IF(MONTH(HZ3)<>MONTH(IA3),TEXT(IA3,\"mmmm aa\"),\"\")","v":""},{"$f":"IF(MONTH(IA3)<>MONTH(IB3),TEXT(IB3,\"mmmm aa\"),\"\")","v":""},{"$f":"IF(MONTH(IB3)<>MONTH(IC3),TEXT(IC3,\"mmmm aa\"),\"\")","v":""},{"$f":"IF(MONTH(IC3)<>MONTH(ID3),TEXT(ID3,\"mmmm aa\"),\"\")","v":""},{"$f":"IF(MONTH(ID3)<>MONTH(IE3),TEXT(IE3,\"mmmm aa\"),\"\")","v":""},{"$f":"IF(MONTH(IE3)<>MONTH(IF3),TEXT(IF3,\"mmmm aa\"),\"\")","v":""},{"$f":"IF(MONTH(IF3)<>MONTH(IG3),TEXT(IG3,\"mmmm aa\"),\"\")","v":""},{"$f":"IF(MONTH(IG3)<>MONTH(IH3),TEXT(IH3,\"mmmm aa\"),\"\")","v":"mai 19"},{"$f":"IF(MONTH(IH3)<>MONTH(II3),TEXT(II3,\"mmmm aa\"),\"\")","v":""},{"$f":"IF(MONTH(II3)<>MONTH(IJ3),TEXT(IJ3,\"mmmm aa\"),\"\")","v":""},{"$f":"IF(MONTH(IJ3)<>MONTH(IK3),TEXT(IK3,\"mmmm aa\"),\"\")","v":""},{"$f":"IF(MONTH(IK3)<>MONTH(IL3),TEXT(IL3,\"mmmm aa\"),\"\")","v":""},{"$f":"IF(MONTH(IL3)<>MONTH(IM3),TEXT(IM3,\"mmmm aa\"),\"\")","v":""},{"$f":"IF(MONTH(IM3)<>MONTH(IN3),TEXT(IN3,\"mmmm aa\"),\"\")","v":""},{"$f":"IF(MONTH(IN3)<>MONTH(IO3),TEXT(IO3,\"mmmm aa\"),\"\")","v":""},{"$f":"IF(MONTH(IO3)<>MONTH(IP3),TEXT(IP3,\"mmmm aa\"),\"\")","v":""},{"$f":"IF(MONTH(IP3)<>MONTH(IQ3),TEXT(IQ3,\"mmmm aa\"),\"\")","v":""},{"$f":"IF(MONTH(IQ3)<>MONTH(IR3),TEXT(IR3,\"mmmm aa\"),\"\")","v":""},{"$f":"IF(MONTH(IR3)<>MONTH(IS3),TEXT(IS3,\"mmmm aa\"),\"\")","v":""},{"$f":"IF(MONTH(IS3)<>MONTH(IT3),TEXT(IT3,\"mmmm aa\"),\"\")","v":""},{"$f":"IF(MONTH(IT3)<>MONTH(IU3),TEXT(IU3,\"mmmm aa\"),\"\")","v":""},{"$f":"IF(MONTH(IU3)<>MONTH(IV3),TEXT(IV3,\"mmmm aa\"),\"\")","v":""},{"$f":"IF(MONTH(IV3)<>MONTH(IW3),TEXT(IW3,\"mmmm aa\"),\"\")","v":""},{"$f":"IF(MONTH(IW3)<>MONTH(IX3),TEXT(IX3,\"mmmm aa\"),\"\")","v":""},{"$f":"IF(MONTH(IX3)<>MONTH(IY3),TEXT(IY3,\"mmmm aa\"),\"\")","v":""},{"$f":"IF(MONTH(IY3)<>MONTH(IZ3),TEXT(IZ3,\"mmmm aa\"),\"\")","v":""},{"$f":"IF(MONTH(IZ3)<>MONTH(JA3),TEXT(JA3,\"mmmm aa\"),\"\")","v":""},{"$f":"IF(MONTH(JA3)<>MONTH(JB3),TEXT(JB3,\"mmmm aa\"),\"\")","v":""},{"$f":"IF(MONTH(JB3)<>MONTH(JC3),TEXT(JC3,\"mmmm aa\"),\"\")","v":""},{"$f":"IF(MONTH(JC3)<>MONTH(JD3),TEXT(JD3,\"mmmm aa\"),\"\")","v":""},{"$f":"IF(MONTH(JD3)<>MONTH(JE3),TEXT(JE3,\"mmmm aa\"),\"\")","v":""},{"$f":"IF(MONTH(JE3)<>MONTH(JF3),TEXT(JF3,\"mmmm aa\"),\"\")","v":""},{"$f":"IF(MONTH(JF3)<>MONTH(JG3),TEXT(JG3,\"mmmm aa\"),\"\")","v":""},{"$f":"IF(MONTH(JG3)<>MONTH(JH3),TEXT(JH3,\"mmmm aa\"),\"\")","v":""},{"$f":"IF(MONTH(JH3)<>MONTH(JI3),TEXT(JI3,\"mmmm aa\"),\"\")","v":""},{"$f":"IF(MONTH(JI3)<>MONTH(JJ3),TEXT(JJ3,\"mmmm aa\"),\"\")","v":""},{"$f":"IF(MONTH(JJ3)<>MONTH(JK3),TEXT(JK3,\"mmmm aa\"),\"\")","v":""},{"$f":"IF(MONTH(JK3)<>MONTH(JL3),TEXT(JL3,\"mmmm aa\"),\"\")","v":""},{"$f":"IF(MONTH(JL3)<>MONTH(JM3),TEXT(JM3,\"mmmm aa\"),\"\")","v":""},{"$f":"IF(MONTH(JM3)<>MONTH(JN3),TEXT(JN3,\"mmmm aa\"),\"\")","v":""},{"$f":"IF(MONTH(JN3)<>MONTH(JO3),TEXT(JO3,\"mmmm aa\"),\"\")","v":""},{"$f":"IF(MONTH(JO3)<>MONTH(JP3),TEXT(JP3,\"mmmm aa\"),\"\")","v":""},{"$f":"IF(MONTH(JP3)<>MONTH(JQ3),TEXT(JQ3,\"mmmm aa\"),\"\")","v":""},{"$f":"IF(MONTH(JQ3)<>MONTH(JR3),TEXT(JR3,\"mmmm aa\"),\"\")","v":""},{"$f":"IF(MONTH(JR3)<>MONTH(JS3),TEXT(JS3,\"mmmm aa\"),\"\")","v":""},{"$f":"IF(MONTH(JS3)<>MONTH(JT3),TEXT(JT3,\"mmmm aa\"),\"\")","v":""},{"$f":"IF(MONTH(JT3)<>MONTH(JU3),TEXT(JU3,\"mmmm aa\"),\"\")","v":""},{"$f":"IF(MONTH(JU3)<>MONTH(JV3),TEXT(JV3,\"mmmm aa\"),\"\")","v":""},{"$f":"IF(MONTH(JV3)<>MONTH(JW3),TEXT(JW3,\"mmmm aa\"),\"\")","v":""},{"$f":"IF(MONTH(JW3)<>MONTH(JX3),TEXT(JX3,\"mmmm aa\"),\"\")","v":""},{"$f":"IF(MONTH(JX3)<>MONTH(JY3),TEXT(JY3,\"mmmm aa\"),\"\")","v":""},{"$f":"IF(MONTH(JY3)<>MONTH(JZ3),TEXT(JZ3,\"mmmm aa\"),\"\")","v":""},{"$f":"IF(MONTH(JZ3)<>MONTH(KA3),TEXT(KA3,\"mmmm aa\"),\"\")","v":""},{"$f":"IF(MONTH(KA3)<>MONTH(KB3),TEXT(KB3,\"mmmm aa\"),\"\")","v":""},{"$f":"IF(MONTH(KB3)<>MONTH(KC3),TEXT(KC3,\"mmmm aa\"),\"\")","v":""},{"$f":"IF(MONTH(KC3)<>MONTH(KD3),TEXT(KD3,\"mmmm aa\"),\"\")","v":""},{"$f":"IF(MONTH(KD3)<>MONTH(KE3),TEXT(KE3,\"mmmm aa\"),\"\")","v":""},{"$f":"IF(MONTH(KE3)<>MONTH(KF3),TEXT(KF3,\"mmmm aa\"),\"\")","v":""},{"$f":"IF(MONTH(KF3)<>MONTH(KG3),TEXT(KG3,\"mmmm aa\"),\"\")","v":""},{"$f":"IF(MONTH(KG3)<>MONTH(KH3),TEXT(KH3,\"mmmm aa\"),\"\")","v":""},{"$f":"IF(MONTH(KH3)<>MONTH(KI3),TEXT(KI3,\"mmmm aa\"),\"\")","v":""},{"$f":"IF(MONTH(KI3)<>MONTH(KJ3),TEXT(KJ3,\"mmmm aa\"),\"\")","v":""},{"$f":"IF(MONTH(KJ3)<>MONTH(KK3),TEXT(KK3,\"mmmm aa\"),\"\")","v":""},{"$f":"IF(MONTH(KK3)<>MONTH(KL3),TEXT(KL3,\"mmmm aa\"),\"\")","v":""},{"$f":"IF(MONTH(KL3)<>MONTH(KM3),TEXT(KM3,\"mmmm aa\"),\"\")","v":""},{"$f":"IF(MONTH(KM3)<>MONTH(KN3),TEXT(KN3,\"mmmm aa\"),\"\")","v":""},{"$f":"IF(MONTH(KN3)<>MONTH(KO3),TEXT(KO3,\"mmmm aa\"),\"\")","v":""},{"$f":"IF(MONTH(KO3)<>MONTH(KP3),TEXT(KP3,\"mmmm aa\"),\"\")","v":""},{"$f":"IF(MONTH(KP3)<>MONTH(KQ3),TEXT(KQ3,\"mmmm aa\"),\"\")","v":""},{"$f":"IF(MONTH(KQ3)<>MONTH(KR3),TEXT(KR3,\"mmmm aa\"),\"\")","v":"juin 19"},{"$f":"IF(MONTH(KR3)<>MONTH(KS3),TEXT(KS3,\"mmmm aa\"),\"\")","v":""},{"$f":"IF(MONTH(KS3)<>MONTH(KT3),TEXT(KT3,\"mmmm aa\"),\"\")","v":""},{"$f":"IF(MONTH(KT3)<>MONTH(KU3),TEXT(KU3,\"mmmm aa\"),\"\")","v":""},{"$f":"IF(MONTH(KU3)<>MONTH(KV3),TEXT(KV3,\"mmmm aa\"),\"\")","v":""},{"$f":"IF(MONTH(KV3)<>MONTH(KW3),TEXT(KW3,\"mmmm aa\"),\"\")","v":""},{"$f":"IF(MONTH(KW3)<>MONTH(KX3),TEXT(KX3,\"mmmm aa\"),\"\")","v":""},{"$f":"IF(MONTH(KX3)<>MONTH(KY3),TEXT(KY3,\"mmmm aa\"),\"\")","v":""},{"$f":"IF(MONTH(KY3)<>MONTH(KZ3),TEXT(KZ3,\"mmmm aa\"),\"\")","v":""},{"$f":"IF(MONTH(KZ3)<>MONTH(LA3),TEXT(LA3,\"mmmm aa\"),\"\")","v":""},{"$f":"IF(MONTH(LA3)<>MONTH(LB3),TEXT(LB3,\"mmmm aa\"),\"\")","v":""},{"$f":"IF(MONTH(LB3)<>MONTH(LC3),TEXT(LC3,\"mmmm aa\"),\"\")","v":""},{"$f":"IF(MONTH(LC3)<>MONTH(LD3),TEXT(LD3,\"mmmm aa\"),\"\")","v":""},{"$f":"IF(MONTH(LD3)<>MONTH(LE3),TEXT(LE3,\"mmmm aa\"),\"\")","v":""},{"$f":"IF(MONTH(LE3)<>MONTH(LF3),TEXT(LF3,\"mmmm aa\"),\"\")","v":""},{"$f":"IF(MONTH(LF3)<>MONTH(LG3),TEXT(LG3,\"mmmm aa\"),\"\")","v":""},{"$f":"IF(MONTH(LG3)<>MONTH(LH3),TEXT(LH3,\"mmmm aa\"),\"\")","v":""},{"$f":"IF(MONTH(LH3)<>MONTH(LI3),TEXT(LI3,\"mmmm aa\"),\"\")","v":""},{"$f":"IF(MONTH(LI3)<>MONTH(LJ3),TEXT(LJ3,\"mmmm aa\"),\"\")","v":""},{"$f":"IF(MONTH(LJ3)<>MONTH(LK3),TEXT(LK3,\"mmmm aa\"),\"\")","v":""},{"$f":"IF(MONTH(LK3)<>MONTH(LL3),TEXT(LL3,\"mmmm aa\"),\"\")","v":""},{"$f":"IF(MONTH(LL3)<>MONTH(LM3),TEXT(LM3,\"mmmm aa\"),\"\")","v":""},{"$f":"IF(MONTH(LM3)<>MONTH(LN3),TEXT(LN3,\"mmmm aa\"),\"\")","v":""},{"$f":"IF(MONTH(LN3)<>MONTH(LO3),TEXT(LO3,\"mmmm aa\"),\"\")","v":""},{"$f":"IF(MONTH(LO3)<>MONTH(LP3),TEXT(LP3,\"mmmm aa\"),\"\")","v":""},{"$f":"IF(MONTH(LP3)<>MONTH(LQ3),TEXT(LQ3,\"mmmm aa\"),\"\")","v":""},{"$f":"IF(MONTH(LQ3)<>MONTH(LR3),TEXT(LR3,\"mmmm aa\"),\"\")","v":""},{"$f":"IF(MONTH(LR3)<>MONTH(LS3),TEXT(LS3,\"mmmm aa\"),\"\")","v":""},{"$f":"IF(MONTH(LS3)<>MONTH(LT3),TEXT(LT3,\"mmmm aa\"),\"\")","v":""},{"$f":"IF(MONTH(LT3)<>MONTH(LU3),TEXT(LU3,\"mmmm aa\"),\"\")","v":""},{"$f":"IF(MONTH(LU3)<>MONTH(LV3),TEXT(LV3,\"mmmm aa\"),\"\")","v":""},{"$f":"IF(MONTH(LV3)<>MONTH(LW3),TEXT(LW3,\"mmmm aa\"),\"\")","v":""},{"$f":"IF(MONTH(LW3)<>MONTH(LX3),TEXT(LX3,\"mmmm aa\"),\"\")","v":""},{"$f":"IF(MONTH(LX3)<>MONTH(LY3),TEXT(LY3,\"mmmm aa\"),\"\")","v":""},{"$f":"IF(MONTH(LY3)<>MONTH(LZ3),TEXT(LZ3,\"mmmm aa\"),\"\")","v":""},{"$f":"IF(MONTH(LZ3)<>MONTH(MA3),TEXT(MA3,\"mmmm aa\"),\"\")","v":""},{"$f":"IF(MONTH(MA3)<>MONTH(MB3),TEXT(MB3,\"mmmm aa\"),\"\")","v":""},{"$f":"IF(MONTH(MB3)<>MONTH(MC3),TEXT(MC3,\"mmmm aa\"),\"\")","v":""},{"$f":"IF(MONTH(MC3)<>MONTH(MD3),TEXT(MD3,\"mmmm aa\"),\"\")","v":""},{"$f":"IF(MONTH(MD3)<>MONTH(ME3),TEXT(ME3,\"mmmm aa\"),\"\")","v":""},{"$f":"IF(MONTH(ME3)<>MONTH(MF3),TEXT(MF3,\"mmmm aa\"),\"\")","v":""},{"$f":"IF(MONTH(MF3)<>MONTH(MG3),TEXT(MG3,\"mmmm aa\"),\"\")","v":""},{"$f":"IF(MONTH(MG3)<>MONTH(MH3),TEXT(MH3,\"mmmm aa\"),\"\")","v":""},{"$f":"IF(MONTH(MH3)<>MONTH(MI3),TEXT(MI3,\"mmmm aa\"),\"\")","v":""},{"$f":"IF(MONTH(MI3)<>MONTH(MJ3),TEXT(MJ3,\"mmmm aa\"),\"\")","v":""},{"$f":"IF(MONTH(MJ3)<>MONTH(MK3),TEXT(MK3,\"mmmm aa\"),\"\")","v":""},{"$f":"IF(MONTH(MK3)<>MONTH(ML3),TEXT(ML3,\"mmmm aa\"),\"\")","v":""},{"$f":"IF(MONTH(ML3)<>MONTH(MM3),TEXT(MM3,\"mmmm aa\"),\"\")","v":""},{"$f":"IF(MONTH(MM3)<>MONTH(MN3),TEXT(MN3,\"mmmm aa\"),\"\")","v":""},{"$f":"IF(MONTH(MN3)<>MONTH(MO3),TEXT(MO3,\"mmmm aa\"),\"\")","v":""},{"$f":"IF(MONTH(MO3)<>MONTH(MP3),TEXT(MP3,\"mmmm aa\"),\"\")","v":""},{"$f":"IF(MONTH(MP3)<>MONTH(MQ3),TEXT(MQ3,\"mmmm aa\"),\"\")","v":""},{"$f":"IF(MONTH(MQ3)<>MONTH(MR3),TEXT(MR3,\"mmmm aa\"),\"\")","v":""},{"$f":"IF(MONTH(MR3)<>MONTH(MS3),TEXT(MS3,\"mmmm aa\"),\"\")","v":""},{"$f":"IF(MONTH(MS3)<>MONTH(MT3),TEXT(MT3,\"mmmm aa\"),\"\")","v":""},{"$f":"IF(MONTH(MT3)<>MONTH(MU3),TEXT(MU3,\"mmmm aa\"),\"\")","v":""},{"$f":"IF(MONTH(MU3)<>MONTH(MV3),TEXT(MV3,\"mmmm aa\"),\"\")","v":""},{"$f":"IF(MONTH(MV3)<>MONTH(MW3),TEXT(MW3,\"mmmm aa\"),\"\")","v":""},{"$f":"IF(MONTH(MW3)<>MONTH(MX3),TEXT(MX3,\"mmmm aa\"),\"\")","v":""},{"$f":"IF(MONTH(MX3)<>MONTH(MY3),TEXT(MY3,\"mmmm aa\"),\"\")","v":""},{"$f":"IF(MONTH(MY3)<>MONTH(MZ3),TEXT(MZ3,\"mmmm aa\"),\"\")","v":"juillet 19"},{"$f":"IF(MONTH(MZ3)<>MONTH(NA3),TEXT(NA3,\"mmmm aa\"),\"\")","v":""},{"$f":"IF(MONTH(NA3)<>MONTH(NB3),TEXT(NB3,\"mmmm aa\"),\"\")","v":""},{"$f":"IF(MONTH(NB3)<>MONTH(NC3),TEXT(NC3,\"mmmm aa\"),\"\")","v":""},{"$f":"IF(MONTH(NC3)<>MONTH(ND3),TEXT(ND3,\"mmmm aa\"),\"\")","v":""},{"$f":"IF(MONTH(ND3)<>MONTH(NE3),TEXT(NE3,\"mmmm aa\"),\"\")","v":""},{"$f":"IF(MONTH(NE3)<>MONTH(NF3),TEXT(NF3,\"mmmm aa\"),\"\")","v":""},{"$f":"IF(MONTH(NF3)<>MONTH(NG3),TEXT(NG3,\"mmmm aa\"),\"\")","v":""},{"$f":"IF(MONTH(NG3)<>MONTH(NH3),TEXT(NH3,\"mmmm aa\"),\"\")","v":""},{"$f":"IF(MONTH(NH3)<>MONTH(NI3),TEXT(NI3,\"mmmm aa\"),\"\")","v":""},{"$f":"IF(MONTH(NI3)<>MONTH(NJ3),TEXT(NJ3,\"mmmm aa\"),\"\")","v":""},{"$f":"IF(MONTH(NJ3)<>MONTH(NK3),TEXT(NK3,\"mmmm aa\"),\"\")","v":""},{"$f":"IF(MONTH(NK3)<>MONTH(NL3),TEXT(NL3,\"mmmm aa\"),\"\")","v":""},{"$f":"IF(MONTH(NL3)<>MONTH(NM3),TEXT(NM3,\"mmmm aa\"),\"\")","v":""},{"$f":"IF(MONTH(NM3)<>MONTH(NN3),TEXT(NN3,\"mmmm aa\"),\"\")","v":""},{"$f":"IF(MONTH(NN3)<>MONTH(NO3),TEXT(NO3,\"mmmm aa\"),\"\")","v":""},{"$f":"IF(MONTH(NO3)<>MONTH(NP3),TEXT(NP3,\"mmmm aa\"),\"\")","v":""},{"$f":"IF(MONTH(NP3)<>MONTH(NQ3),TEXT(NQ3,\"mmmm aa\"),\"\")","v":""},{"$f":"IF(MONTH(NQ3)<>MONTH(NR3),TEXT(NR3,\"mmmm aa\"),\"\")","v":""},{"$f":"IF(MONTH(NR3)<>MONTH(NS3),TEXT(NS3,\"mmmm aa\"),\"\")","v":""},{"$f":"IF(MONTH(NS3)<>MONTH(NT3),TEXT(NT3,\"mmmm aa\"),\"\")","v":""},{"$f":"IF(MONTH(NT3)<>MONTH(NU3),TEXT(NU3,\"mmmm aa\"),\"\")","v":""},{"$f":"IF(MONTH(NU3)<>MONTH(NV3),TEXT(NV3,\"mmmm aa\"),\"\")","v":""},{"$f":"IF(MONTH(NV3)<>MONTH(NW3),TEXT(NW3,\"mmmm aa\"),\"\")","v":""},{"$f":"IF(MONTH(NW3)<>MONTH(NX3),TEXT(NX3,\"mmmm aa\"),\"\")","v":""},{"$f":"IF(MONTH(NX3)<>MONTH(NY3),TEXT(NY3,\"mmmm aa\"),\"\")","v":""},{"$f":"IF(MONTH(NY3)<>MONTH(NZ3),TEXT(NZ3,\"mmmm aa\"),\"\")","v":""},{"$f":"IF(MONTH(NZ3)<>MONTH(OA3),TEXT(OA3,\"mmmm aa\"),\"\")","v":""},{"$f":"IF(MONTH(OA3)<>MONTH(OB3),TEXT(OB3,\"mmmm aa\"),\"\")","v":""},{"$f":"IF(MONTH(OB3)<>MONTH(OC3),TEXT(OC3,\"mmmm aa\"),\"\")","v":""},{"$f":"IF(MONTH(OC3)<>MONTH(OD3),TEXT(OD3,\"mmmm aa\"),\"\")","v":""},{"$f":"IF(MONTH(OD3)<>MONTH(OE3),TEXT(OE3,\"mmmm aa\"),\"\")","v":""},{"$f":"IF(MONTH(OE3)<>MONTH(OF3),TEXT(OF3,\"mmmm aa\"),\"\")","v":""},{"$f":"IF(MONTH(OF3)<>MONTH(OG3),TEXT(OG3,\"mmmm aa\"),\"\")","v":""},{"$f":"IF(MONTH(OG3)<>MONTH(OH3),TEXT(OH3,\"mmmm aa\"),\"\")","v":""},{"$f":"IF(MONTH(OH3)<>MONTH(OI3),TEXT(OI3,\"mmmm aa\"),\"\")","v":""},{"$f":"IF(MONTH(OI3)<>MONTH(OJ3),TEXT(OJ3,\"mmmm aa\"),\"\")","v":""},{"$f":"IF(MONTH(OJ3)<>MONTH(OK3),TEXT(OK3,\"mmmm aa\"),\"\")","v":""},{"$f":"IF(MONTH(OK3)<>MONTH(OL3),TEXT(OL3,\"mmmm aa\"),\"\")","v":""},{"$f":"IF(MONTH(OL3)<>MONTH(OM3),TEXT(OM3,\"mmmm aa\"),\"\")","v":""},{"$f":"IF(MONTH(OM3)<>MONTH(ON3),TEXT(ON3,\"mmmm aa\"),\"\")","v":""},{"$f":"IF(MONTH(ON3)<>MONTH(OO3),TEXT(OO3,\"mmmm aa\"),\"\")","v":""},{"$f":"IF(MONTH(OO3)<>MONTH(OP3),TEXT(OP3,\"mmmm aa\"),\"\")","v":""},{"$f":"IF(MONTH(OP3)<>MONTH(OQ3),TEXT(OQ3,\"mmmm aa\"),\"\")","v":""},{"$f":"IF(MONTH(OQ3)<>MONTH(OR3),TEXT(OR3,\"mmmm aa\"),\"\")","v":""},{"$f":"IF(MONTH(OR3)<>MONTH(OS3),TEXT(OS3,\"mmmm aa\"),\"\")","v":""},{"$f":"IF(MONTH(OS3)<>MONTH(OT3),TEXT(OT3,\"mmmm aa\"),\"\")","v":""},{"$f":"IF(MONTH(OT3)<>MONTH(OU3),TEXT(OU3,\"mmmm aa\"),\"\")","v":""},{"$f":"IF(MONTH(OU3)<>MONTH(OV3),TEXT(OV3,\"mmmm aa\"),\"\")","v":""},{"$f":"IF(MONTH(OV3)<>MONTH(OW3),TEXT(OW3,\"mmmm aa\"),\"\")","v":""},{"$f":"IF(MONTH(OW3)<>MONTH(OX3),TEXT(OX3,\"mmmm aa\"),\"\")","v":""},{"$f":"IF(MONTH(OX3)<>MONTH(OY3),TEXT(OY3,\"mmmm aa\"),\"\")","v":""},{"$f":"IF(MONTH(OY3)<>MONTH(OZ3),TEXT(OZ3,\"mmmm aa\"),\"\")","v":""},{"$f":"IF(MONTH(OZ3)<>MONTH(PA3),TEXT(PA3,\"mmmm aa\"),\"\")","v":""},{"$f":"IF(MONTH(PA3)<>MONTH(PB3),TEXT(PB3,\"mmmm aa\"),\"\")","v":""},{"$f":"IF(MONTH(PB3)<>MONTH(PC3),TEXT(PC3,\"mmmm aa\"),\"\")","v":""},{"$f":"IF(MONTH(PC3)<>MONTH(PD3),TEXT(PD3,\"mmmm aa\"),\"\")","v":""},{"$f":"IF(MONTH(PD3)<>MONTH(PE3),TEXT(PE3,\"mmmm aa\"),\"\")","v":""},{"$f":"IF(MONTH(PE3)<>MONTH(PF3),TEXT(PF3,\"mmmm aa\"),\"\")","v":""},{"$f":"IF(MONTH(PF3)<>MONTH(PG3),TEXT(PG3,\"mmmm aa\"),\"\")","v":""},{"$f":"IF(MONTH(PG3)<>MONTH(PH3),TEXT(PH3,\"mmmm aa\"),\"\")","v":""},{"$f":"IF(MONTH(PH3)<>MONTH(PI3),TEXT(PI3,\"mmmm aa\"),\"\")","v":""},{"$f":"IF(MONTH(PI3)<>MONTH(PJ3),TEXT(PJ3,\"mmmm aa\"),\"\")","v":"août 19"},{"$f":"IF(MONTH(PJ3)<>MONTH(PK3),TEXT(PK3,\"mmmm aa\"),\"\")","v":""},{"$f":"IF(MONTH(PK3)<>MONTH(PL3),TEXT(PL3,\"mmmm aa\"),\"\")","v":""},{"$f":"IF(MONTH(PL3)<>MONTH(PM3),TEXT(PM3,\"mmmm aa\"),\"\")","v":""},{"$f":"IF(MONTH(PM3)<>MONTH(PN3),TEXT(PN3,\"mmmm aa\"),\"\")","v":""},{"$f":"IF(MONTH(PN3)<>MONTH(PO3),TEXT(PO3,\"mmmm aa\"),\"\")","v":""},{"$f":"IF(MONTH(PO3)<>MONTH(PP3),TEXT(PP3,\"mmmm aa\"),\"\")","v":""},{"$f":"IF(MONTH(PP3)<>MONTH(PQ3),TEXT(PQ3,\"mmmm aa\"),\"\")","v":""},{"$f":"IF(MONTH(PQ3)<>MONTH(PR3),TEXT(PR3,\"mmmm aa\"),\"\")","v":""},{"$f":"IF(MONTH(PR3)<>MONTH(PS3),TEXT(PS3,\"mmmm aa\"),\"\")","v":""},{"$f":"IF(MONTH(PS3)<>MONTH(PT3),TEXT(PT3,\"mmmm aa\"),\"\")","v":""},{"$f":"IF(MONTH(PT3)<>MONTH(PU3),TEXT(PU3,\"mmmm aa\"),\"\")","v":""},{"$f":"IF(MONTH(PU3)<>MONTH(PV3),TEXT(PV3,\"mmmm aa\"),\"\")","v":""},{"$f":"IF(MONTH(PV3)<>MONTH(PW3),TEXT(PW3,\"mmmm aa\"),\"\")","v":""},{"$f":"IF(MONTH(PW3)<>MONTH(PX3),TEXT(PX3,\"mmmm aa\"),\"\")","v":""},{"$f":"IF(MONTH(PX3)<>MONTH(PY3),TEXT(PY3,\"mmmm aa\"),\"\")","v":""},{"$f":"IF(MONTH(PY3)<>MONTH(PZ3),TEXT(PZ3,\"mmmm aa\"),\"\")","v":""},{"$f":"IF(MONTH(PZ3)<>MONTH(QA3),TEXT(QA3,\"mmmm aa\"),\"\")","v":""},{"$f":"IF(MONTH(QA3)<>MONTH(QB3),TEXT(QB3,\"mmmm aa\"),\"\")","v":""},{"$f":"IF(MONTH(QB3)<>MONTH(QC3),TEXT(QC3,\"mmmm aa\"),\"\")","v":""},{"$f":"IF(MONTH(QC3)<>MONTH(QD3),TEXT(QD3,\"mmmm aa\"),\"\")","v":""},{"$f":"IF(MONTH(QD3)<>MONTH(QE3),TEXT(QE3,\"mmmm aa\"),\"\")","v":""},{"$f":"IF(MONTH(QE3)<>MONTH(QF3),TEXT(QF3,\"mmmm aa\"),\"\")","v":""},{"$f":"IF(MONTH(QF3)<>MONTH(QG3),TEXT(QG3,\"mmmm aa\"),\"\")","v":""},{"$f":"IF(MONTH(QG3)<>MONTH(QH3),TEXT(QH3,\"mmmm aa\"),\"\")","v":""},{"$f":"IF(MONTH(QH3)<>MONTH(QI3),TEXT(QI3,\"mmmm aa\"),\"\")","v":""},{"$f":"IF(MONTH(QI3)<>MONTH(QJ3),TEXT(QJ3,\"mmmm aa\"),\"\")","v":""},{"$f":"IF(MONTH(QJ3)<>MONTH(QK3),TEXT(QK3,\"mmmm aa\"),\"\")","v":""},{"$f":"IF(MONTH(QK3)<>MONTH(QL3),TEXT(QL3,\"mmmm aa\"),\"\")","v":""},{"$f":"IF(MONTH(QL3)<>MONTH(QM3),TEXT(QM3,\"mmmm aa\"),\"\")","v":""},{"$f":"IF(MONTH(QM3)<>MONTH(QN3),TEXT(QN3,\"mmmm aa\"),\"\")","v":""},{"$f":"IF(MONTH(QN3)<>MONTH(QO3),TEXT(QO3,\"mmmm aa\"),\"\")","v":""},{"$f":"IF(MONTH(QO3)<>MONTH(QP3),TEXT(QP3,\"mmmm aa\"),\"\")","v":""},{"$f":"IF(MONTH(QP3)<>MONTH(QQ3),TEXT(QQ3,\"mmmm aa\"),\"\")","v":""},{"$f":"IF(MONTH(QQ3)<>MONTH(QR3),TEXT(QR3,\"mmmm aa\"),\"\")","v":""},{"$f":"IF(MONTH(QR3)<>MONTH(QS3),TEXT(QS3,\"mmmm aa\"),\"\")","v":""},{"$f":"IF(MONTH(QS3)<>MONTH(QT3),TEXT(QT3,\"mmmm aa\"),\"\")","v":""},{"$f":"IF(MONTH(QT3)<>MONTH(QU3),TEXT(QU3,\"mmmm aa\"),\"\")","v":""},{"$f":"IF(MONTH(QU3)<>MONTH(QV3),TEXT(QV3,\"mmmm aa\"),\"\")","v":""},{"$f":"IF(MONTH(QV3)<>MONTH(QW3),TEXT(QW3,\"mmmm aa\"),\"\")","v":""},{"$f":"IF(MONTH(QW3)<>MONTH(QX3),TEXT(QX3,\"mmmm aa\"),\"\")","v":""},{"$f":"IF(MONTH(QX3)<>MONTH(QY3),TEXT(QY3,\"mmmm aa\"),\"\")","v":""},{"$f":"IF(MONTH(QY3)<>MONTH(QZ3),TEXT(QZ3,\"mmmm aa\"),\"\")","v":""},{"$f":"IF(MONTH(QZ3)<>MONTH(RA3),TEXT(RA3,\"mmmm aa\"),\"\")","v":""},{"$f":"IF(MONTH(RA3)<>MONTH(RB3),TEXT(RB3,\"mmmm aa\"),\"\")","v":""},{"$f":"IF(MONTH(RB3)<>MONTH(RC3),TEXT(RC3,\"mmmm aa\"),\"\")","v":""},{"$f":"IF(MONTH(RC3)<>MONTH(RD3),TEXT(RD3,\"mmmm aa\"),\"\")","v":""},{"$f":"IF(MONTH(RD3)<>MONTH(RE3),TEXT(RE3,\"mmmm aa\"),\"\")","v":""},{"$f":"IF(MONTH(RE3)<>MONTH(RF3),TEXT(RF3,\"mmmm aa\"),\"\")","v":""},{"$f":"IF(MONTH(RF3)<>MONTH(RG3),TEXT(RG3,\"mmmm aa\"),\"\")","v":""},{"$f":"IF(MONTH(RG3)<>MONTH(RH3),TEXT(RH3,\"mmmm aa\"),\"\")","v":""},{"$f":"IF(MONTH(RH3)<>MONTH(RI3),TEXT(RI3,\"mmmm aa\"),\"\")","v":""},{"$f":"IF(MONTH(RI3)<>MONTH(RJ3),TEXT(RJ3,\"mmmm aa\"),\"\")","v":""},{"$f":"IF(MONTH(RJ3)<>MONTH(RK3),TEXT(RK3,\"mmmm aa\"),\"\")","v":""},{"$f":"IF(MONTH(RK3)<>MONTH(RL3),TEXT(RL3,\"mmmm aa\"),\"\")","v":""},{"$f":"IF(MONTH(RL3)<>MONTH(RM3),TEXT(RM3,\"mmmm aa\"),\"\")","v":""},{"$f":"IF(MONTH(RM3)<>MONTH(RN3),TEXT(RN3,\"mmmm aa\"),\"\")","v":""},{"$f":"IF(MONTH(RN3)<>MONTH(RO3),TEXT(RO3,\"mmmm aa\"),\"\")","v":""},{"$f":"IF(MONTH(RO3)<>MONTH(RP3),TEXT(RP3,\"mmmm aa\"),\"\")","v":""},{"$f":"IF(MONTH(RP3)<>MONTH(RQ3),TEXT(RQ3,\"mmmm aa\"),\"\")","v":""},{"$f":"IF(MONTH(RQ3)<>MONTH(RR3),TEXT(RR3,\"mmmm aa\"),\"\")","v":""},{"$f":"IF(MONTH(RR3)<>MONTH(RS3),TEXT(RS3,\"mmmm aa\"),\"\")","v":""},{"$f":"IF(MONTH(RS3)<>MONTH(RT3),TEXT(RT3,\"mmmm aa\"),\"\")","v":"septembre 19"},{"$f":"IF(MONTH(RT3)<>MONTH(RU3),TEXT(RU3,\"mmmm aa\"),\"\")","v":""},{"$f":"IF(MONTH(RU3)<>MONTH(RV3),TEXT(RV3,\"mmmm aa\"),\"\")","v":""},{"$f":"IF(MONTH(RV3)<>MONTH(RW3),TEXT(RW3,\"mmmm aa\"),\"\")","v":""},{"$f":"IF(MONTH(RW3)<>MONTH(RX3),TEXT(RX3,\"mmmm aa\"),\"\")","v":""},{"$f":"IF(MONTH(RX3)<>MONTH(RY3),TEXT(RY3,\"mmmm aa\"),\"\")","v":""},{"$f":"IF(MONTH(RY3)<>MONTH(RZ3),TEXT(RZ3,\"mmmm aa\"),\"\")","v":""},{"$f":"IF(MONTH(RZ3)<>MONTH(SA3),TEXT(SA3,\"mmmm aa\"),\"\")","v":""},{"$f":"IF(MONTH(SA3)<>MONTH(SB3),TEXT(SB3,\"mmmm aa\"),\"\")","v":""},{"$f":"IF(MONTH(SB3)<>MONTH(SC3),TEXT(SC3,\"mmmm aa\"),\"\")","v":""},{"$f":"IF(MONTH(SC3)<>MONTH(SD3),TEXT(SD3,\"mmmm aa\"),\"\")","v":""},{"$f":"IF(MONTH(SD3)<>MONTH(SE3),TEXT(SE3,\"mmmm aa\"),\"\")","v":""},{"$f":"IF(MONTH(SE3)<>MONTH(SF3),TEXT(SF3,\"mmmm aa\"),\"\")","v":""},{"$f":"IF(MONTH(SF3)<>MONTH(SG3),TEXT(SG3,\"mmmm aa\"),\"\")","v":""},{"$f":"IF(MONTH(SG3)<>MONTH(SH3),TEXT(SH3,\"mmmm aa\"),\"\")","v":""},{"$f":"IF(MONTH(SH3)<>MONTH(SI3),TEXT(SI3,\"mmmm aa\"),\"\")","v":""},{"$f":"IF(MONTH(SI3)<>MONTH(SJ3),TEXT(SJ3,\"mmmm aa\"),\"\")","v":""},{"$f":"IF(MONTH(SJ3)<>MONTH(SK3),TEXT(SK3,\"mmmm aa\"),\"\")","v":""},{"$f":"IF(MONTH(SK3)<>MONTH(SL3),TEXT(SL3,\"mmmm aa\"),\"\")","v":""},{"$f":"IF(MONTH(SL3)<>MONTH(SM3),TEXT(SM3,\"mmmm aa\"),\"\")","v":""},{"$f":"IF(MONTH(SM3)<>MONTH(SN3),TEXT(SN3,\"mmmm aa\"),\"\")","v":""},{"$f":"IF(MONTH(SN3)<>MONTH(SO3),TEXT(SO3,\"mmmm aa\"),\"\")","v":""},{"$f":"IF(MONTH(SO3)<>MONTH(SP3),TEXT(SP3,\"mmmm aa\"),\"\")","v":""},{"$f":"IF(MONTH(SP3)<>MONTH(SQ3),TEXT(SQ3,\"mmmm aa\"),\"\")","v":""},{"$f":"IF(MONTH(SQ3)<>MONTH(SR3),TEXT(SR3,\"mmmm aa\"),\"\")","v":""},{"$f":"IF(MONTH(SR3)<>MONTH(SS3),TEXT(SS3,\"mmmm aa\"),\"\")","v":""},{"$f":"IF(MONTH(SS3)<>MONTH(ST3),TEXT(ST3,\"mmmm aa\"),\"\")","v":""},{"$f":"IF(MONTH(ST3)<>MONTH(SU3),TEXT(SU3,\"mmmm aa\"),\"\")","v":""},{"$f":"IF(MONTH(SU3)<>MONTH(SV3),TEXT(SV3,\"mmmm aa\"),\"\")","v":""},{"$f":"IF(MONTH(SV3)<>MONTH(SW3),TEXT(SW3,\"mmmm aa\"),\"\")","v":""},{"$f":"IF(MONTH(SW3)<>MONTH(SX3),TEXT(SX3,\"mmmm aa\"),\"\")","v":""},{"$f":"IF(MONTH(SX3)<>MONTH(SY3),TEXT(SY3,\"mmmm aa\"),\"\")","v":""},{"$f":"IF(MONTH(SY3)<>MONTH(SZ3),TEXT(SZ3,\"mmmm aa\"),\"\")","v":""},{"$f":"IF(MONTH(SZ3)<>MONTH(TA3),TEXT(TA3,\"mmmm aa\"),\"\")","v":""},{"$f":"IF(MONTH(TA3)<>MONTH(TB3),TEXT(TB3,\"mmmm aa\"),\"\")","v":""},{"$f":"IF(MONTH(TB3)<>MONTH(TC3),TEXT(TC3,\"mmmm aa\"),\"\")","v":""},{"$f":"IF(MONTH(TC3)<>MONTH(TD3),TEXT(TD3,\"mmmm aa\"),\"\")","v":""},{"$f":"IF(MONTH(TD3)<>MONTH(TE3),TEXT(TE3,\"mmmm aa\"),\"\")","v":""},{"$f":"IF(MONTH(TE3)<>MONTH(TF3),TEXT(TF3,\"mmmm aa\"),\"\")","v":""},{"$f":"IF(MONTH(TF3)<>MONTH(TG3),TEXT(TG3,\"mmmm aa\"),\"\")","v":""},{"$f":"IF(MONTH(TG3)<>MONTH(TH3),TEXT(TH3,\"mmmm aa\"),\"\")","v":""},{"$f":"IF(MONTH(TH3)<>MONTH(TI3),TEXT(TI3,\"mmmm aa\"),\"\")","v":""},{"$f":"IF(MONTH(TI3)<>MONTH(TJ3),TEXT(TJ3,\"mmmm aa\"),\"\")","v":""},{"$f":"IF(MONTH(TJ3)<>MONTH(TK3),TEXT(TK3,\"mmmm aa\"),\"\")","v":""},{"$f":"IF(MONTH(TK3)<>MONTH(TL3),TEXT(TL3,\"mmmm aa\"),\"\")","v":""},{"$f":"IF(MONTH(TL3)<>MONTH(TM3),TEXT(TM3,\"mmmm aa\"),\"\")","v":""},{"$f":"IF(MONTH(TM3)<>MONTH(TN3),TEXT(TN3,\"mmmm aa\"),\"\")","v":""},{"$f":"IF(MONTH(TN3)<>MONTH(TO3),TEXT(TO3,\"mmmm aa\"),\"\")","v":""},{"$f":"IF(MONTH(TO3)<>MONTH(TP3),TEXT(TP3,\"mmmm aa\"),\"\")","v":""},{"$f":"IF(MONTH(TP3)<>MONTH(TQ3),TEXT(TQ3,\"mmmm aa\"),\"\")","v":""},{"$f":"IF(MONTH(TQ3)<>MONTH(TR3),TEXT(TR3,\"mmmm aa\"),\"\")","v":""},{"$f":"IF(MONTH(TR3)<>MONTH(TS3),TEXT(TS3,\"mmmm aa\"),\"\")","v":""},{"$f":"IF(MONTH(TS3)<>MONTH(TT3),TEXT(TT3,\"mmmm aa\"),\"\")","v":""},{"$f":"IF(MONTH(TT3)<>MONTH(TU3),TEXT(TU3,\"mmmm aa\"),\"\")","v":""},{"$f":"IF(MONTH(TU3)<>MONTH(TV3),TEXT(TV3,\"mmmm aa\"),\"\")","v":""},{"$f":"IF(MONTH(TV3)<>MONTH(TW3),TEXT(TW3,\"mmmm aa\"),\"\")","v":""},{"$f":"IF(MONTH(TW3)<>MONTH(TX3),TEXT(TX3,\"mmmm aa\"),\"\")","v":""},{"$f":"IF(MONTH(TX3)<>MONTH(TY3),TEXT(TY3,\"mmmm aa\"),\"\")","v":""},{"$f":"IF(MONTH(TY3)<>MONTH(TZ3),TEXT(TZ3,\"mmmm aa\"),\"\")","v":""},{"$f":"IF(MONTH(TZ3)<>MONTH(UA3),TEXT(UA3,\"mmmm aa\"),\"\")","v":""},{"$f":"IF(MONTH(UA3)<>MONTH(UB3),TEXT(UB3,\"mmmm aa\"),\"\")","v":"octobre 19"},{"$f":"IF(MONTH(UB3)<>MONTH(UC3),TEXT(UC3,\"mmmm aa\"),\"\")","v":""},{"$f":"IF(MONTH(UC3)<>MONTH(UD3),TEXT(UD3,\"mmmm aa\"),\"\")","v":""},{"$f":"IF(MONTH(UD3)<>MONTH(UE3),TEXT(UE3,\"mmmm aa\"),\"\")","v":""},{"$f":"IF(MONTH(UE3)<>MONTH(UF3),TEXT(UF3,\"mmmm aa\"),\"\")","v":""},{"$f":"IF(MONTH(UF3)<>MONTH(UG3),TEXT(UG3,\"mmmm aa\"),\"\")","v":""},{"$f":"IF(MONTH(UG3)<>MONTH(UH3),TEXT(UH3,\"mmmm aa\"),\"\")","v":""},{"$f":"IF(MONTH(UH3)<>MONTH(UI3),TEXT(UI3,\"mmmm aa\"),\"\")","v":""},{"$f":"IF(MONTH(UI3)<>MONTH(UJ3),TEXT(UJ3,\"mmmm aa\"),\"\")","v":""},{"$f":"IF(MONTH(UJ3)<>MONTH(UK3),TEXT(UK3,\"mmmm aa\"),\"\")","v":""},{"$f":"IF(MONTH(UK3)<>MONTH(UL3),TEXT(UL3,\"mmmm aa\"),\"\")","v":""},{"$f":"IF(MONTH(UL3)<>MONTH(UM3),TEXT(UM3,\"mmmm aa\"),\"\")","v":""},{"$f":"IF(MONTH(UM3)<>MONTH(UN3),TEXT(UN3,\"mmmm aa\"),\"\")","v":""},{"$f":"IF(MONTH(UN3)<>MONTH(UO3),TEXT(UO3,\"mmmm aa\"),\"\")","v":""},{"$f":"IF(MONTH(UO3)<>MONTH(UP3),TEXT(UP3,\"mmmm aa\"),\"\")","v":""},{"$f":"IF(MONTH(UP3)<>MONTH(UQ3),TEXT(UQ3,\"mmmm aa\"),\"\")","v":""},{"$f":"IF(MONTH(UQ3)<>MONTH(UR3),TEXT(UR3,\"mmmm aa\"),\"\")","v":""},{"$f":"IF(MONTH(UR3)<>MONTH(US3),TEXT(US3,\"mmmm aa\"),\"\")","v":""},{"$f":"IF(MONTH(US3)<>MONTH(UT3),TEXT(UT3,\"mmmm aa\"),\"\")","v":""},{"$f":"IF(MONTH(UT3)<>MONTH(UU3),TEXT(UU3,\"mmmm aa\"),\"\")","v":""},{"$f":"IF(MONTH(UU3)<>MONTH(UV3),TEXT(UV3,\"mmmm aa\"),\"\")","v":""},{"$f":"IF(MONTH(UV3)<>MONTH(UW3),TEXT(UW3,\"mmmm aa\"),\"\")","v":""},{"$f":"IF(MONTH(UW3)<>MONTH(UX3),TEXT(UX3,\"mmmm aa\"),\"\")","v":""},{"$f":"IF(MONTH(UX3)<>MONTH(UY3),TEXT(UY3,\"mmmm aa\"),\"\")","v":""},{"$f":"IF(MONTH(UY3)<>MONTH(UZ3),TEXT(UZ3,\"mmmm aa\"),\"\")","v":""},{"$f":"IF(MONTH(UZ3)<>MONTH(VA3),TEXT(VA3,\"mmmm aa\"),\"\")","v":""},{"$f":"IF(MONTH(VA3)<>MONTH(VB3),TEXT(VB3,\"mmmm aa\"),\"\")","v":""},{"$f":"IF(MONTH(VB3)<>MONTH(VC3),TEXT(VC3,\"mmmm aa\"),\"\")","v":""},{"$f":"IF(MONTH(VC3)<>MONTH(VD3),TEXT(VD3,\"mmmm aa\"),\"\")","v":""},{"$f":"IF(MONTH(VD3)<>MONTH(VE3),TEXT(VE3,\"mmmm aa\"),\"\")","v":""},{"$f":"IF(MONTH(VE3)<>MONTH(VF3),TEXT(VF3,\"mmmm aa\"),\"\")","v":""},{"$f":"IF(MONTH(VF3)<>MONTH(VG3),TEXT(VG3,\"mmmm aa\"),\"\")","v":""},{"$f":"IF(MONTH(VG3)<>MONTH(VH3),TEXT(VH3,\"mmmm aa\"),\"\")","v":""},{"$f":"IF(MONTH(VH3)<>MONTH(VI3),TEXT(VI3,\"mmmm aa\"),\"\")","v":""},{"$f":"IF(MONTH(VI3)<>MONTH(VJ3),TEXT(VJ3,\"mmmm aa\"),\"\")","v":""},{"$f":"IF(MONTH(VJ3)<>MONTH(VK3),TEXT(VK3,\"mmmm aa\"),\"\")","v":""},{"$f":"IF(MONTH(VK3)<>MONTH(VL3),TEXT(VL3,\"mmmm aa\"),\"\")","v":""},{"$f":"IF(MONTH(VL3)<>MONTH(VM3),TEXT(VM3,\"mmmm aa\"),\"\")","v":""},{"$f":"IF(MONTH(VM3)<>MONTH(VN3),TEXT(VN3,\"mmmm aa\"),\"\")","v":""},{"$f":"IF(MONTH(VN3)<>MONTH(VO3),TEXT(VO3,\"mmmm aa\"),\"\")","v":""},{"$f":"IF(MONTH(VO3)<>MONTH(VP3),TEXT(VP3,\"mmmm aa\"),\"\")","v":""},{"$f":"IF(MONTH(VP3)<>MONTH(VQ3),TEXT(VQ3,\"mmmm aa\"),\"\")","v":""},{"$f":"IF(MONTH(VQ3)<>MONTH(VR3),TEXT(VR3,\"mmmm aa\"),\"\")","v":""},{"$f":"IF(MONTH(VR3)<>MONTH(VS3),TEXT(VS3,\"mmmm aa\"),\"\")","v":""},{"$f":"IF(MONTH(VS3)<>MONTH(VT3),TEXT(VT3,\"mmmm aa\"),\"\")","v":""},{"$f":"IF(MONTH(VT3)<>MONTH(VU3),TEXT(VU3,\"mmmm aa\"),\"\")","v":""},{"$f":"IF(MONTH(VU3)<>MONTH(VV3),TEXT(VV3,\"mmmm aa\"),\"\")","v":""},{"$f":"IF(MONTH(VV3)<>MONTH(VW3),TEXT(VW3,\"mmmm aa\"),\"\")","v":""},{"$f":"IF(MONTH(VW3)<>MONTH(VX3),TEXT(VX3,\"mmmm aa\"),\"\")","v":""},{"$f":"IF(MONTH(VX3)<>MONTH(VY3),TEXT(VY3,\"mmmm aa\"),\"\")","v":""},{"$f":"IF(MONTH(VY3)<>MONTH(VZ3),TEXT(VZ3,\"mmmm aa\"),\"\")","v":""},{"$f":"IF(MONTH(VZ3)<>MONTH(WA3),TEXT(WA3,\"mmmm aa\"),\"\")","v":""},{"$f":"IF(MONTH(WA3)<>MONTH(WB3),TEXT(WB3,\"mmmm aa\"),\"\")","v":""},{"$f":"IF(MONTH(WB3)<>MONTH(WC3),TEXT(WC3,\"mmmm aa\"),\"\")","v":""},{"$f":"IF(MONTH(WC3)<>MONTH(WD3),TEXT(WD3,\"mmmm aa\"),\"\")","v":""},{"$f":"IF(MONTH(WD3)<>MONTH(WE3),TEXT(WE3,\"mmmm aa\"),\"\")","v":""},{"$f":"IF(MONTH(WE3)<>MONTH(WF3),TEXT(WF3,\"mmmm aa\"),\"\")","v":""},{"$f":"IF(MONTH(WF3)<>MONTH(WG3),TEXT(WG3,\"mmmm aa\"),\"\")","v":""},{"$f":"IF(MONTH(WG3)<>MONTH(WH3),TEXT(WH3,\"mmmm aa\"),\"\")","v":""},{"$f":"IF(MONTH(WH3)<>MONTH(WI3),TEXT(WI3,\"mmmm aa\"),\"\")","v":""},{"$f":"IF(MONTH(WI3)<>MONTH(WJ3),TEXT(WJ3,\"mmmm aa\"),\"\")","v":""},{"$f":"IF(MONTH(WJ3)<>MONTH(WK3),TEXT(WK3,\"mmmm aa\"),\"\")","v":""},{"$f":"IF(MONTH(WK3)<>MONTH(WL3),TEXT(WL3,\"mmmm aa\"),\"\")","v":"novembre 19"},{"$f":"IF(MONTH(WL3)<>MONTH(WM3),TEXT(WM3,\"mmmm aa\"),\"\")","v":""},{"$f":"IF(MONTH(WM3)<>MONTH(WN3),TEXT(WN3,\"mmmm aa\"),\"\")","v":""},{"$f":"IF(MONTH(WN3)<>MONTH(WO3),TEXT(WO3,\"mmmm aa\"),\"\")","v":""},{"$f":"IF(MONTH(WO3)<>MONTH(WP3),TEXT(WP3,\"mmmm aa\"),\"\")","v":""},{"$f":"IF(MONTH(WP3)<>MONTH(WQ3),TEXT(WQ3,\"mmmm aa\"),\"\")","v":""},{"$f":"IF(MONTH(WQ3)<>MONTH(WR3),TEXT(WR3,\"mmmm aa\"),\"\")","v":""},{"$f":"IF(MONTH(WR3)<>MONTH(WS3),TEXT(WS3,\"mmmm aa\"),\"\")","v":""},{"$f":"IF(MONTH(WS3)<>MONTH(WT3),TEXT(WT3,\"mmmm aa\"),\"\")","v":""},{"$f":"IF(MONTH(WT3)<>MONTH(WU3),TEXT(WU3,\"mmmm aa\"),\"\")","v":""},{"$f":"IF(MONTH(WU3)<>MONTH(WV3),TEXT(WV3,\"mmmm aa\"),\"\")","v":""},{"$f":"IF(MONTH(WV3)<>MONTH(WW3),TEXT(WW3,\"mmmm aa\"),\"\")","v":""},{"$f":"IF(MONTH(WW3)<>MONTH(WX3),TEXT(WX3,\"mmmm aa\"),\"\")","v":""},{"$f":"IF(MONTH(WX3)<>MONTH(WY3),TEXT(WY3,\"mmmm aa\"),\"\")","v":""},{"$f":"IF(MONTH(WY3)<>MONTH(WZ3),TEXT(WZ3,\"mmmm aa\"),\"\")","v":""},{"$f":"IF(MONTH(WZ3)<>MONTH(XA3),TEXT(XA3,\"mmmm aa\"),\"\")","v":""},{"$f":"IF(MONTH(XA3)<>MONTH(XB3),TEXT(XB3,\"mmmm aa\"),\"\")","v":""},{"$f":"IF(MONTH(XB3)<>MONTH(XC3),TEXT(XC3,\"mmmm aa\"),\"\")","v":""},{"$f":"IF(MONTH(XC3)<>MONTH(XD3),TEXT(XD3,\"mmmm aa\"),\"\")","v":""},{"$f":"IF(MONTH(XD3)<>MONTH(XE3),TEXT(XE3,\"mmmm aa\"),\"\")","v":""},{"$f":"IF(MONTH(XE3)<>MONTH(XF3),TEXT(XF3,\"mmmm aa\"),\"\")","v":""},{"$f":"IF(MONTH(XF3)<>MONTH(XG3),TEXT(XG3,\"mmmm aa\"),\"\")","v":""},{"$f":"IF(MONTH(XG3)<>MONTH(XH3),TEXT(XH3,\"mmmm aa\"),\"\")","v":""},{"$f":"IF(MONTH(XH3)<>MONTH(XI3),TEXT(XI3,\"mmmm aa\"),\"\")","v":""},{"$f":"IF(MONTH(XI3)<>MONTH(XJ3),TEXT(XJ3,\"mmmm aa\"),\"\")","v":""},{"$f":"IF(MONTH(XJ3)<>MONTH(XK3),TEXT(XK3,\"mmmm aa\"),\"\")","v":""},{"$f":"IF(MONTH(XK3)<>MONTH(XL3),TEXT(XL3,\"mmmm aa\"),\"\")","v":""},{"$f":"IF(MONTH(XL3)<>MONTH(XM3),TEXT(XM3,\"mmmm aa\"),\"\")","v":""},{"$f":"IF(MONTH(XM3)<>MONTH(XN3),TEXT(XN3,\"mmmm aa\"),\"\")","v":""},{"$f":"IF(MONTH(XN3)<>MONTH(XO3),TEXT(XO3,\"mmmm aa\"),\"\")","v":""},{"$f":"IF(MONTH(XO3)<>MONTH(XP3),TEXT(XP3,\"mmmm aa\"),\"\")","v":""},{"$f":"IF(MONTH(XP3)<>MONTH(XQ3),TEXT(XQ3,\"mmmm aa\"),\"\")","v":""},{"$f":"IF(MONTH(XQ3)<>MONTH(XR3),TEXT(XR3,\"mmmm aa\"),\"\")","v":""},{"$f":"IF(MONTH(XR3)<>MONTH(XS3),TEXT(XS3,\"mmmm aa\"),\"\")","v":""},{"$f":"IF(MONTH(XS3)<>MONTH(XT3),TEXT(XT3,\"mmmm aa\"),\"\")","v":""},{"$f":"IF(MONTH(XT3)<>MONTH(XU3),TEXT(XU3,\"mmmm aa\"),\"\")","v":""},{"$f":"IF(MONTH(XU3)<>MONTH(XV3),TEXT(XV3,\"mmmm aa\"),\"\")","v":""},{"$f":"IF(MONTH(XV3)<>MONTH(XW3),TEXT(XW3,\"mmmm aa\"),\"\")","v":""},{"$f":"IF(MONTH(XW3)<>MONTH(XX3),TEXT(XX3,\"mmmm aa\"),\"\")","v":""},{"$f":"IF(MONTH(XX3)<>MONTH(XY3),TEXT(XY3,\"mmmm aa\"),\"\")","v":""},{"$f":"IF(MONTH(XY3)<>MONTH(XZ3),TEXT(XZ3,\"mmmm aa\"),\"\")","v":""},{"$f":"IF(MONTH(XZ3)<>MONTH(YA3),TEXT(YA3,\"mmmm aa\"),\"\")","v":""},{"$f":"IF(MONTH(YA3)<>MONTH(YB3),TEXT(YB3,\"mmmm aa\"),\"\")","v":""},{"$f":"IF(MONTH(YB3)<>MONTH(YC3),TEXT(YC3,\"mmmm aa\"),\"\")","v":""},{"$f":"IF(MONTH(YC3)<>MONTH(YD3),TEXT(YD3,\"mmmm aa\"),\"\")","v":""},{"$f":"IF(MONTH(YD3)<>MONTH(YE3),TEXT(YE3,\"mmmm aa\"),\"\")","v":""},{"$f":"IF(MONTH(YE3)<>MONTH(YF3),TEXT(YF3,\"mmmm aa\"),\"\")","v":""},{"$f":"IF(MONTH(YF3)<>MONTH(YG3),TEXT(YG3,\"mmmm aa\"),\"\")","v":""},{"$f":"IF(MONTH(YG3)<>MONTH(YH3),TEXT(YH3,\"mmmm aa\"),\"\")","v":""},{"$f":"IF(MONTH(YH3)<>MONTH(YI3),TEXT(YI3,\"mmmm aa\"),\"\")","v":""},{"$f":"IF(MONTH(YI3)<>MONTH(YJ3),TEXT(YJ3,\"mmmm aa\"),\"\")","v":""},{"$f":"IF(MONTH(YJ3)<>MONTH(YK3),TEXT(YK3,\"mmmm aa\"),\"\")","v":""},{"$f":"IF(MONTH(YK3)<>MONTH(YL3),TEXT(YL3,\"mmmm aa\"),\"\")","v":""},{"$f":"IF(MONTH(YL3)<>MONTH(YM3),TEXT(YM3,\"mmmm aa\"),\"\")","v":""},{"$f":"IF(MONTH(YM3)<>MONTH(YN3),TEXT(YN3,\"mmmm aa\"),\"\")","v":""},{"$f":"IF(MONTH(YN3)<>MONTH(YO3),TEXT(YO3,\"mmmm aa\"),\"\")","v":""},{"$f":"IF(MONTH(YO3)<>MONTH(YP3),TEXT(YP3,\"mmmm aa\"),\"\")","v":""},{"$f":"IF(MONTH(YP3)<>MONTH(YQ3),TEXT(YQ3,\"mmmm aa\"),\"\")","v":""},{"$f":"IF(MONTH(YQ3)<>MONTH(YR3),TEXT(YR3,\"mmmm aa\"),\"\")","v":""},{"$f":"IF(MONTH(YR3)<>MONTH(YS3),TEXT(YS3,\"mmmm aa\"),\"\")","v":""},{"$f":"IF(MONTH(YS3)<>MONTH(YT3),TEXT(YT3,\"mmmm aa\"),\"\")","v":"décembre 19"},{"$f":"IF(MONTH(YT3)<>MONTH(YU3),TEXT(YU3,\"mmmm aa\"),\"\")","v":""},{"$f":"IF(MONTH(YU3)<>MONTH(YV3),TEXT(YV3,\"mmmm aa\"),\"\")","v":""},{"$f":"IF(MONTH(YV3)<>MONTH(YW3),TEXT(YW3,\"mmmm aa\"),\"\")","v":""},{"$f":"IF(MONTH(YW3)<>MONTH(YX3),TEXT(YX3,\"mmmm aa\"),\"\")","v":""},{"$f":"IF(MONTH(YX3)<>MONTH(YY3),TEXT(YY3,\"mmmm aa\"),\"\")","v":""},{"$f":"IF(MONTH(YY3)<>MONTH(YZ3),TEXT(YZ3,\"mmmm aa\"),\"\")","v":""},{"$f":"IF(MONTH(YZ3)<>MONTH(ZA3),TEXT(ZA3,\"mmmm aa\"),\"\")","v":""},{"$f":"IF(MONTH(ZA3)<>MONTH(ZB3),TEXT(ZB3,\"mmmm aa\"),\"\")","v":""},{"$f":"IF(MONTH(ZB3)<>MONTH(ZC3),TEXT(ZC3,\"mmmm aa\"),\"\")","v":""},{"$f":"IF(MONTH(ZC3)<>MONTH(ZD3),TEXT(ZD3,\"mmmm aa\"),\"\")","v":""},{"$f":"IF(MONTH(ZD3)<>MONTH(ZE3),TEXT(ZE3,\"mmmm aa\"),\"\")","v":""},{"$f":"IF(MONTH(ZE3)<>MONTH(ZF3),TEXT(ZF3,\"mmmm aa\"),\"\")","v":""},{"$f":"IF(MONTH(ZF3)<>MONTH(ZG3),TEXT(ZG3,\"mmmm aa\"),\"\")","v":""},{"$f":"IF(MONTH(ZG3)<>MONTH(ZH3),TEXT(ZH3,\"mmmm aa\"),\"\")","v":""},{"$f":"IF(MONTH(ZH3)<>MONTH(ZI3),TEXT(ZI3,\"mmmm aa\"),\"\")","v":""},{"$f":"IF(MONTH(ZI3)<>MONTH(ZJ3),TEXT(ZJ3,\"mmmm aa\"),\"\")","v":""},{"$f":"IF(MONTH(ZJ3)<>MONTH(ZK3),TEXT(ZK3,\"mmmm aa\"),\"\")","v":""},{"$f":"IF(MONTH(ZK3)<>MONTH(ZL3),TEXT(ZL3,\"mmmm aa\"),\"\")","v":""},{"$f":"IF(MONTH(ZL3)<>MONTH(ZM3),TEXT(ZM3,\"mmmm aa\"),\"\")","v":""},{"$f":"IF(MONTH(ZM3)<>MONTH(ZN3),TEXT(ZN3,\"mmmm aa\"),\"\")","v":""},{"$f":"IF(MONTH(ZN3)<>MONTH(ZO3),TEXT(ZO3,\"mmmm aa\"),\"\")","v":""},{"$f":"IF(MONTH(ZO3)<>MONTH(ZP3),TEXT(ZP3,\"mmmm aa\"),\"\")","v":""},{"$f":"IF(MONTH(ZP3)<>MONTH(ZQ3),TEXT(ZQ3,\"mmmm aa\"),\"\")","v":""},{"$f":"IF(MONTH(ZQ3)<>MONTH(ZR3),TEXT(ZR3,\"mmmm aa\"),\"\")","v":""},{"$f":"IF(MONTH(ZR3)<>MONTH(ZS3),TEXT(ZS3,\"mmmm aa\"),\"\")","v":""},{"$f":"IF(MONTH(ZS3)<>MONTH(ZT3),TEXT(ZT3,\"mmmm aa\"),\"\")","v":""},{"$f":"IF(MONTH(ZT3)<>MONTH(ZU3),TEXT(ZU3,\"mmmm aa\"),\"\")","v":""},{"$f":"IF(MONTH(ZU3)<>MONTH(ZV3),TEXT(ZV3,\"mmmm aa\"),\"\")","v":""},{"$f":"IF(MONTH(ZV3)<>MONTH(ZW3),TEXT(ZW3,\"mmmm aa\"),\"\")","v":""},{"$f":"IF(MONTH(ZW3)<>MONTH(ZX3),TEXT(ZX3,\"mmmm aa\"),\"\")","v":""},{"$f":"IF(MONTH(ZX3)<>MONTH(ZY3),TEXT(ZY3,\"mmmm aa\"),\"\")","v":""},{"$f":"IF(MONTH(ZY3)<>MONTH(ZZ3),TEXT(ZZ3,\"mmmm aa\"),\"\")","v":""},{"$f":"IF(MONTH(ZZ3)<>MONTH(AAA3),TEXT(AAA3,\"mmmm aa\"),\"\")","v":""},{"$f":"IF(MONTH(AAA3)<>MONTH(AAB3),TEXT(AAB3,\"mmmm aa\"),\"\")","v":""},{"$f":"IF(MONTH(AAB3)<>MONTH(AAC3),TEXT(AAC3,\"mmmm aa\"),\"\")","v":""},{"$f":"IF(MONTH(AAC3)<>MONTH(AAD3),TEXT(AAD3,\"mmmm aa\"),\"\")","v":""},{"$f":"IF(MONTH(AAD3)<>MONTH(AAE3),TEXT(AAE3,\"mmmm aa\"),\"\")","v":""},{"$f":"IF(MONTH(AAE3)<>MONTH(AAF3),TEXT(AAF3,\"mmmm aa\"),\"\")","v":""},{"$f":"IF(MONTH(AAF3)<>MONTH(AAG3),TEXT(AAG3,\"mmmm aa\"),\"\")","v":""},{"$f":"IF(MONTH(AAG3)<>MONTH(AAH3),TEXT(AAH3,\"mmmm aa\"),\"\")","v":""},{"$f":"IF(MONTH(AAH3)<>MONTH(AAI3),TEXT(AAI3,\"mmmm aa\"),\"\")","v":""},{"$f":"IF(MONTH(AAI3)<>MONTH(AAJ3),TEXT(AAJ3,\"mmmm aa\"),\"\")","v":""},{"$f":"IF(MONTH(AAJ3)<>MONTH(AAK3),TEXT(AAK3,\"mmmm aa\"),\"\")","v":""},{"$f":"IF(MONTH(AAK3)<>MONTH(AAL3),TEXT(AAL3,\"mmmm aa\"),\"\")","v":""},{"$f":"IF(MONTH(AAL3)<>MONTH(AAM3),TEXT(AAM3,\"mmmm aa\"),\"\")","v":""},{"$f":"IF(MONTH(AAM3)<>MONTH(AAN3),TEXT(AAN3,\"mmmm aa\"),\"\")","v":""},{"$f":"IF(MONTH(AAN3)<>MONTH(AAO3),TEXT(AAO3,\"mmmm aa\"),\"\")","v":""},{"$f":"IF(MONTH(AAO3)<>MONTH(AAP3),TEXT(AAP3,\"mmmm aa\"),\"\")","v":""},{"$f":"IF(MONTH(AAP3)<>MONTH(AAQ3),TEXT(AAQ3,\"mmmm aa\"),\"\")","v":""},{"$f":"IF(MONTH(AAQ3)<>MONTH(AAR3),TEXT(AAR3,\"mmmm aa\"),\"\")","v":""},{"$f":"IF(MONTH(AAR3)<>MONTH(AAS3),TEXT(AAS3,\"mmmm aa\"),\"\")","v":""},{"$f":"IF(MONTH(AAS3)<>MONTH(AAT3),TEXT(AAT3,\"mmmm aa\"),\"\")","v":""},{"$f":"IF(MONTH(AAT3)<>MONTH(AAU3),TEXT(AAU3,\"mmmm aa\"),\"\")","v":""},{"$f":"IF(MONTH(AAU3)<>MONTH(AAV3),TEXT(AAV3,\"mmmm aa\"),\"\")","v":""},{"$f":"IF(MONTH(AAV3)<>MONTH(AAW3),TEXT(AAW3,\"mmmm aa\"),\"\")","v":""},{"$f":"IF(MONTH(AAW3)<>MONTH(AAX3),TEXT(AAX3,\"mmmm aa\"),\"\")","v":""},{"$f":"IF(MONTH(AAX3)<>MONTH(AAY3),TEXT(AAY3,\"mmmm aa\"),\"\")","v":""},{"$f":"IF(MONTH(AAY3)<>MONTH(AAZ3),TEXT(AAZ3,\"mmmm aa\"),\"\")","v":""},{"$f":"IF(MONTH(AAZ3)<>MONTH(ABA3),TEXT(ABA3,\"mmmm aa\"),\"\")","v":""},{"$f":"IF(MONTH(ABA3)<>MONTH(ABB3),TEXT(ABB3,\"mmmm aa\"),\"\")","v":""},{"$f":"IF(MONTH(ABB3)<>MONTH(ABC3),TEXT(ABC3,\"mmmm aa\"),\"\")","v":""},{"$f":"IF(MONTH(ABC3)<>MONTH(ABD3),TEXT(ABD3,\"mmmm aa\"),\"\")","v":"janvier 20"},{"$f":"IF(MONTH(ABD3)<>MONTH(ABE3),TEXT(ABE3,\"mmmm aa\"),\"\")","v":""},null,null,{"$f":"IF(MONTH(ABG3)<>MONTH(ABH3),TEXT(ABH3,\"mmmm aa\"),\"\")","v":""},{"$f":"IF(MONTH(ABH3)<>MONTH(ABI3),TEXT(ABI3,\"mmmm aa\"),\"\")","v":""},{"$f":"IF(MONTH(ABI3)<>MONTH(ABJ3),TEXT(ABJ3,\"mmmm aa\"),\"\")","v":""},{"$f":"IF(MONTH(ABJ3)<>MONTH(ABK3),TEXT(ABK3,\"mmmm aa\"),\"\")","v":""}]
[null,{"$f":"DATE(Année,1,1)","v":"2019-01-01"},{"$f":"B2","v":"2019-01-01"},{"$f":"B2+1","v":"2019-01-02"},{"$f":"C2+1","v":"2019-01-02"},{"$f":"D2+1","v":"2019-01-03"},"2019-01-03","2019-01-04","2019-01-04","2019-01-05","2019-01-05","2019-01-06","2019-01-06","2019-01-07","2019-01-07","2019-01-08","2019-01-08",{"$f":"P2+1","v":"2019-01-09"},"2019-01-09",{"$f":"R2+1","v":"2019-01-10"},{"$f":"S2+1","v":"2019-01-10"},{"$f":"T2+1","v":"2019-01-11"},{"$f":"U2+1","v":"2019-01-11"},{"$f":"V2+1","v":"2019-01-12"},{"$f":"W2+1","v":"2019-01-12"},{"$f":"X2+1","v":"2019-01-13"},{"$f":"Y2+1","v":"2019-01-13"},{"$f":"Z2+1","v":"2019-01-14"},{"$f":"AA2+1","v":"2019-01-14"},{"$f":"AB2+1","v":"2019-01-15"},{"$f":"AC2+1","v":"2019-01-15"},{"$f":"AD2+1","v":"2019-01-16"},"2019-01-16",{"$f":"AF2+1","v":"2019-01-17"},{"$f":"AG2+1","v":"2019-01-17"},{"$f":"AH2+1","v":"2019-01-18"},{"$f":"AI2+1","v":"2019-01-18"},{"$f":"AJ2+1","v":"2019-01-19"},{"$f":"AK2+1","v":"2019-01-19"},{"$f":"AL2+1","v":"2019-01-20"},{"$f":"AM2+1","v":"2019-01-20"},{"$f":"AN2+1","v":"2019-01-21"},{"$f":"AO2+1","v":"2019-01-21"},{"$f":"AP2+1","v":"2019-01-22"},{"$f":"AQ2+1","v":"2019-01-22"},{"$f":"AR2+1","v":"2019-01-23"},"2019-01-23",{"$f":"AT2+1","v":"2019-01-24"},{"$f":"AU2+1","v":"2019-01-24"},{"$f":"AV2+1","v":"2019-01-25"},{"$f":"AW2+1","v":"2019-01-25"},{"$f":"AX2+1","v":"2019-01-26"},{"$f":"AY2+1","v":"2019-01-26"},{"$f":"AZ2+1","v":"2019-01-27"},{"$f":"BA2+1","v":"2019-01-27"},{"$f":"BB2+1","v":"2019-01-28"},{"$f":"BC2+1","v":"2019-01-28"},{"$f":"BD2+1","v":"2019-01-29"},{"$f":"BE2+1","v":"2019-01-29"},"2019-01-30",{"$f":"BG2+1","v":"2019-01-30"},{"$f":"BH2+1","v":"2019-01-31"},{"$f":"BI2+1","v":"2019-01-31"},{"$f":"BJ2+1","v":"2019-02-01"},{"$f":"BK2+1","v":"2019-02-01"},{"$f":"BL2+1","v":"2019-02-02"},{"$f":"BM2+1","v":"2019-02-02"},{"$f":"BN2+1","v":"2019-02-03"},{"$f":"BO2+1","v":"2019-02-03"},{"$f":"BP2+1","v":"2019-02-04"},{"$f":"BQ2+1","v":"2019-02-04"},{"$f":"BR2+1","v":"2019-02-05"},{"$f":"BS2+1","v":"2019-02-05"},{"$f":"BT2+1","v":"2019-02-06"},{"$f":"BU2+1","v":"2019-02-06"},{"$f":"BV2+1","v":"2019-02-07"},{"$f":"BW2+1","v":"2019-02-07"},{"$f":"BX2+1","v":"2019-02-08"},{"$f":"BY2+1","v":"2019-02-08"},{"$f":"BZ2+1","v":"2019-02-09"},{"$f":"CA2+1","v":"2019-02-09"},{"$f":"CB2+1","v":"2019-02-10"},{"$f":"CC2+1","v":"2019-02-10"},{"$f":"CD2+1","v":"2019-02-11"},{"$f":"CE2+1","v":"2019-02-11"},{"$f":"CF2+1","v":"2019-02-12"},{"$f":"CG2+1","v":"2019-02-12"},{"$f":"CH2+1","v":"2019-02-13"},{"$f":"CI2+1","v":"2019-02-13"},{"$f":"CJ2+1","v":"2019-02-14"},{"$f":"CK2+1","v":"2019-02-14"},{"$f":"CL2+1","v":"2019-02-15"},{"$f":"CM2+1","v":"2019-02-15"},{"$f":"CN2+1","v":"2019-02-16"},{"$f":"CO2+1","v":"2019-02-16"},{"$f":"CP2+1","v":"2019-02-17"},{"$f":"CQ2+1","v":"2019-02-17"},{"$f":"CR2+1","v":"2019-02-18"},{"$f":"CS2+1","v":"2019-02-18"},{"$f":"CT2+1","v":"2019-02-19"},{"$f":"CU2+1","v":"2019-02-19"},{"$f":"CV2+1","v":"2019-02-20"},{"$f":"CW2+1","v":"2019-02-20"},{"$f":"CX2+1","v":"2019-02-21"},{"$f":"CY2+1","v":"2019-02-21"},{"$f":"CZ2+1","v":"2019-02-22"},{"$f":"DA2+1","v":"2019-02-22"},{"$f":"DB2+1","v":"2019-02-23"},{"$f":"DC2+1","v":"2019-02-23"},{"$f":"DD2+1","v":"2019-02-24"},{"$f":"DE2+1","v":"2019-02-24"},{"$f":"DF2+1","v":"2019-02-25"},{"$f":"DG2+1","v":"2019-02-25"},{"$f":"DH2+1","v":"2019-02-26"},"2019-02-26",{"$f":"DJ2+1","v":"2019-02-27"},{"$f":"DK2+1","v":"2019-02-27"},{"$f":"DL2+1","v":"2019-02-28"},{"$f":"DM2+1","v":"2019-02-28"},{"$f":"DN2+1","v":"2019-03-01"},{"$f":"DO2+1","v":"2019-03-01"},{"$f":"DP2+1","v":"2019-03-02"},{"$f":"DQ2+1","v":"2019-03-02"},{"$f":"DR2+1","v":"2019-03-03"},{"$f":"DS2+1","v":"2019-03-03"},{"$f":"DT2+1","v":"2019-03-04"},{"$f":"DU2+1","v":"2019-03-04"},{"$f":"DV2+1","v":"2019-03-05"},{"$f":"DW2+1","v":"2019-03-05"},{"$f":"DX2+1","v":"2019-03-06"},{"$f":"DY2+1","v":"2019-03-06"},{"$f":"DZ2+1","v":"2019-03-07"},{"$f":"EA2+1","v":"2019-03-07"},{"$f":"EB2+1","v":"2019-03-08"},{"$f":"EC2+1","v":"2019-03-08"},{"$f":"ED2+1","v":"2019-03-09"},{"$f":"EE2+1","v":"2019-03-09"},{"$f":"EF2+1","v":"2019-03-10"},{"$f":"EG2+1","v":"2019-03-10"},{"$f":"EH2+1","v":"2019-03-11"},{"$f":"EI2+1","v":"2019-03-11"},{"$f":"EJ2+1","v":"2019-03-12"},{"$f":"EK2+1","v":"2019-03-12"},{"$f":"EL2+1","v":"2019-03-13"},{"$f":"EM2+1","v":"2019-03-13"},{"$f":"EN2+1","v":"2019-03-14"},{"$f":"EO2+1","v":"2019-03-14"},{"$f":"EP2+1","v":"2019-03-15"},{"$f":"EQ2+1","v":"2019-03-15"},{"$f":"ER2+1","v":"2019-03-16"},{"$f":"ES2+1","v":"2019-03-16"},{"$f":"ET2+1","v":"2019-03-17"},{"$f":"EU2+1","v":"2019-03-17"},{"$f":"EV2+1","v":"2019-03-18"},{"$f":"EW2+1","v":"2019-03-18"},"2019-03-19",{"$f":"EY2+1","v":"2019-03-19"},{"$f":"EZ2+1","v":"2019-03-20"},{"$f":"FA2+1","v":"2019-03-20"},{"$f":"FB2+1","v":"2019-03-21"},{"$f":"FC2+1","v":"2019-03-21"},{"$f":"FD2+1","v":"2019-03-22"},{"$f":"FE2+1","v":"2019-03-22"},{"$f":"FF2+1","v":"2019-03-23"},{"$f":"FG2+1","v":"2019-03-23"},{"$f":"FH2+1","v":"2019-03-24"},{"$f":"FI2+1","v":"2019-03-24"},{"$f":"FJ2+1","v":"2019-03-25"},{"$f":"FK2+1","v":"2019-03-25"},{"$f":"FL2+1","v":"2019-03-26"},{"$f":"FM2+1","v":"2019-03-26"},{"$f":"FN2+1","v":"2019-03-27"},{"$f":"FO2+1","v":"2019-03-27"},{"$f":"FP2+1","v":"2019-03-28"},{"$f":"FQ2+1","v":"2019-03-28"},{"$f":"FR2+1","v":"2019-03-29"},{"$f":"FS2+1","v":"2019-03-29"},{"$f":"FT2+1","v":"2019-03-30"},{"$f":"FU2+1","v":"2019-03-30"},{"$f":"FV2+1","v":"2019-03-31"},{"$f":"FW2+1","v":"2019-03-31"},{"$f":"FX2+1","v":"2019-04-01"},{"$f":"FY2+1","v":"2019-04-01"},{"$f":"FZ2+1","v":"2019-04-02"},{"$f":"GA2+1","v":"2019-04-02"},{"$f":"GB2+1","v":"2019-04-03"},{"$f":"GC2+1","v":"2019-04-03"},{"$f":"GD2+1","v":"2019-04-04"},{"$f":"GE2+1","v":"2019-04-04"},{"$f":"GF2+1","v":"2019-04-05"},{"$f":"GG2+1","v":"2019-04-05"},{"$f":"GH2+1","v":"2019-04-06"},{"$f":"GI2+1","v":"2019-04-06"},{"$f":"GJ2+1","v":"2019-04-07"},{"$f":"GK2+1","v":"2019-04-07"},{"$f":"GL2+1","v":"2019-04-08"},{"$f":"GM2+1","v":"2019-04-08"},{"$f":"GN2+1","v":"2019-04-09"},{"$f":"GO2+1","v":"2019-04-09"},{"$f":"GP2+1","v":"2019-04-10"},{"$f":"GQ2+1","v":"2019-04-10"},{"$f":"GR2+1","v":"2019-04-11"},{"$f":"GS2+1","v":"2019-04-11"},{"$f":"GT2+1","v":"2019-04-12"},{"$f":"GU2+1","v":"2019-04-12"},{"$f":"GV2+1","v":"2019-04-13"},{"$f":"GW2+1","v":"2019-04-13"},{"$f":"GX2+1","v":"2019-04-14"},{"$f":"GY2+1","v":"2019-04-14"},{"$f":"GZ2+1","v":"2019-04-15"},{"$f":"HA2+1","v":"2019-04-15"},{"$f":"HB2+1","v":"2019-04-16"},{"$f":"HC2+1","v":"2019-04-16"},{"$f":"HD2+1","v":"2019-04-17"},{"$f":"HE2+1","v":"2019-04-17"},{"$f":"HF2+1","v":"2019-04-18"},{"$f":"HG2+1","v":"2019-04-18"},{"$f":"HH2+1","v":"2019-04-19"},{"$f":"HI2+1","v":"2019-04-19"},{"$f":"HJ2+1","v":"2019-04-20"},{"$f":"HK2+1","v":"2019-04-20"},{"$f":"HL2+1","v":"2019-04-21"},{"$f":"HM2+1","v":"2019-04-21"},{"$f":"HN2+1","v":"2019-04-22"},{"$f":"HO2+1","v":"2019-04-22"},{"$f":"HP2+1","v":"2019-04-23"},{"$f":"HQ2+1","v":"2019-04-23"},{"$f":"HR2+1","v":"2019-04-24"},{"$f":"HS2+1","v":"2019-04-24"},{"$f":"HT2+1","v":"2019-04-25"},{"$f":"HU2+1","v":"2019-04-25"},{"$f":"HV2+1","v":"2019-04-26"},{"$f":"HW2+1","v":"2019-04-26"},{"$f":"HX2+1","v":"2019-04-27"},{"$f":"HY2+1","v":"2019-04-27"},{"$f":"HZ2+1","v":"2019-04-28"},{"$f":"IA2+1","v":"2019-04-28"},{"$f":"IB2+1","v":"2019-04-29"},{"$f":"IC2+1","v":"2019-04-29"},{"$f":"ID2+1","v":"2019-04-30"},{"$f":"IE2+1","v":"2019-04-30"},{"$f":"IF2+1","v":"2019-05-01"},{"$f":"IG2+1","v":"2019-05-01"},{"$f":"IH2+1","v":"2019-05-02"},{"$f":"II2+1","v":"2019-05-02"},{"$f":"IJ2+1","v":"2019-05-03"},{"$f":"IK2+1","v":"2019-05-03"},{"$f":"IL2+1","v":"2019-05-04"},{"$f":"IM2+1","v":"2019-05-04"},{"$f":"IN2+1","v":"2019-05-05"},{"$f":"IO2+1","v":"2019-05-05"},{"$f":"IP2+1","v":"2019-05-06"},{"$f":"IQ2+1","v":"2019-05-06"},{"$f":"IR2+1","v":"2019-05-07"},{"$f":"IS2+1","v":"2019-05-07"},{"$f":"IT2+1","v":"2019-05-08"},{"$f":"IU2+1","v":"2019-05-08"},{"$f":"IV2+1","v":"2019-05-09"},{"$f":"IW2+1","v":"2019-05-09"},{"$f":"IX2+1","v":"2019-05-10"},{"$f":"IY2+1","v":"2019-05-10"},{"$f":"IZ2+1","v":"2019-05-11"},{"$f":"JA2+1","v":"2019-05-11"},{"$f":"JB2+1","v":"2019-05-12"},{"$f":"JC2+1","v":"2019-05-12"},{"$f":"JD2+1","v":"2019-05-13"},{"$f":"JE2+1","v":"2019-05-13"},{"$f":"JF2+1","v":"2019-05-14"},{"$f":"JG2+1","v":"2019-05-14"},{"$f":"JH2+1","v":"2019-05-15"},{"$f":"JI2+1","v":"2019-05-15"},{"$f":"JJ2+1","v":"2019-05-16"},{"$f":"JK2+1","v":"2019-05-16"},{"$f":"JL2+1","v":"2019-05-17"},{"$f":"JM2+1","v":"2019-05-17"},{"$f":"JN2+1","v":"2019-05-18"},{"$f":"JO2+1","v":"2019-05-18"},{"$f":"JP2+1","v":"2019-05-19"},{"$f":"JQ2+1","v":"2019-05-19"},{"$f":"JR2+1","v":"2019-05-20"},{"$f":"JS2+1","v":"2019-05-20"},{"$f":"JT2+1","v":"2019-05-21"},{"$f":"JU2+1","v":"2019-05-21"},{"$f":"JV2+1","v":"2019-05-22"},{"$f":"JW2+1","v":"2019-05-22"},{"$f":"JX2+1","v":"2019-05-23"},{"$f":"JY2+1","v":"2019-05-23"},{"$f":"JZ2+1","v":"2019-05-24"},{"$f":"KA2+1","v":"2019-05-24"},{"$f":"KB2+1","v":"2019-05-25"},{"$f":"KC2+1","v":"2019-05-25"},{"$f":"KD2+1","v":"2019-05-26"},{"$f":"KE2+1","v":"2019-05-26"},{"$f":"KF2+1","v":"2019-05-27"},{"$f":"KG2+1","v":"2019-05-27"},{"$f":"KH2+1","v":"2019-05-28"},{"$f":"KI2+1","v":"2019-05-28"},{"$f":"KJ2+1","v":"2019-05-29"},{"$f":"KK2+1","v":"2019-05-29"},{"$f":"KL2+1","v":"2019-05-30"},{"$f":"KM2+1","v":"2019-05-30"},{"$f":"KN2+1","v":"2019-05-31"},{"$f":"KO2+1","v":"2019-05-31"},{"$f":"KP2+1","v":"2019-06-01"},{"$f":"KQ2+1","v":"2019-06-01"},{"$f":"KR2+1","v":"2019-06-02"},"2019-06-02",{"$f":"KT2+1","v":"2019-06-03"},{"$f":"KU2+1","v":"2019-06-03"},{"$f":"KV2+1","v":"2019-06-04"},{"$f":"KW2+1","v":"2019-06-04"},{"$f":"KX2+1","v":"2019-06-05"},{"$f":"KY2+1","v":"2019-06-05"},{"$f":"KZ2+1","v":"2019-06-06"},{"$f":"LA2+1","v":"2019-06-06"},{"$f":"LB2+1","v":"2019-06-07"},{"$f":"LC2+1","v":"2019-06-07"},{"$f":"LD2+1","v":"2019-06-08"},{"$f":"LE2+1","v":"2019-06-08"},{"$f":"LF2+1","v":"2019-06-09"},{"$f":"LG2+1","v":"2019-06-09"},{"$f":"LH2+1","v":"2019-06-10"},{"$f":"LI2+1","v":"2019-06-10"},{"$f":"LJ2+1","v":"2019-06-11"},{"$f":"LK2+1","v":"2019-06-11"},{"$f":"LL2+1","v":"2019-06-12"},{"$f":"LM2+1","v":"2019-06-12"},{"$f":"LN2+1","v":"2019-06-13"},{"$f":"LO2+1","v":"2019-06-13"},{"$f":"LP2+1","v":"2019-06-14"},{"$f":"LQ2+1","v":"2019-06-14"},{"$f":"LR2+1","v":"2019-06-15"},{"$f":"LS2+1","v":"2019-06-15"},{"$f":"LT2+1","v":"2019-06-16"},{"$f":"LU2+1","v":"2019-06-16"},{"$f":"LV2+1","v":"2019-06-17"},{"$f":"LW2+1","v":"2019-06-17"},{"$f":"LX2+1","v":"2019-06-18"},{"$f":"LY2+1","v":"2019-06-18"},{"$f":"LZ2+1","v":"2019-06-19"},{"$f":"MA2+1","v":"2019-06-19"},{"$f":"MB2+1","v":"2019-06-20"},{"$f":"MC2+1","v":"2019-06-20"},{"$f":"MD2+1","v":"2019-06-21"},{"$f":"ME2+1","v":"2019-06-21"},{"$f":"MF2+1","v":"2019-06-22"},{"$f":"MG2+1","v":"2019-06-22"},{"$f":"MH2+1","v":"2019-06-23"},{"$f":"MI2+1","v":"2019-06-23"},{"$f":"MJ2+1","v":"2019-06-24"},{"$f":"MK2+1","v":"2019-06-24"},{"$f":"ML2+1","v":"2019-06-25"},{"$f":"MM2+1","v":"2019-06-25"},{"$f":"MN2+1","v":"2019-06-26"},{"$f":"MO2+1","v":"2019-06-26"},{"$f":"MP2+1","v":"2019-06-27"},{"$f":"MQ2+1","v":"2019-06-27"},{"$f":"MR2+1","v":"2019-06-28"},{"$f":"MS2+1","v":"2019-06-28"},{"$f":"MT2+1","v":"2019-06-29"},{"$f":"MU2+1","v":"2019-06-29"},{"$f":"MV2+1","v":"2019-06-30"},{"$f":"MW2+1","v":"2019-06-30"},{"$f":"MX2+1","v":"2019-07-01"},{"$f":"MY2+1","v":"2019-07-01"},{"$f":"MZ2+1","v":"2019-07-02"},{"$f":"NA2+1","v":"2019-07-02"},{"$f":"NB2+1","v":"2019-07-03"},{"$f":"NC2+1","v":"2019-07-03"},{"$f":"ND2+1","v":"2019-07-04"},{"$f":"NE2+1","v":"2019-07-04"},{"$f":"NF2+1","v":"2019-07-05"},{"$f":"NG2+1","v":"2019-07-05"},{"$f":"NH2+1","v":"2019-07-06"},{"$f":"NI2+1","v":"2019-07-06"},{"$f":"NJ2+1","v":"2019-07-07"},{"$f":"NK2+1","v":"2019-07-07"},{"$f":"NL2+1","v":"2019-07-08"},{"$f":"NM2+1","v":"2019-07-08"},{"$f":"NN2+1","v":"2019-07-09"},{"$f":"NO2+1","v":"2019-07-09"},{"$f":"NP2+1","v":"2019-07-10"},{"$f":"NQ2+1","v":"2019-07-10"},{"$f":"NR2+1","v":"2019-07-11"},{"$f":"NS2+1","v":"2019-07-11"},{"$f":"NT2+1","v":"2019-07-12"},{"$f":"NU2+1","v":"2019-07-12"},{"$f":"NV2+1","v":"2019-07-13"},{"$f":"NW2+1","v":"2019-07-13"},{"$f":"NX2+1","v":"2019-07-14"},{"$f":"NY2+1","v":"2019-07-14"},{"$f":"NZ2+1","v":"2019-07-15"},{"$f":"OA2+1","v":"2019-07-15"},{"$f":"OB2+1","v":"2019-07-16"},{"$f":"OC2+1","v":"2019-07-16"},{"$f":"OD2+1","v":"2019-07-17"},{"$f":"OE2+1","v":"2019-07-17"},{"$f":"OF2+1","v":"2019-07-18"},{"$f":"OG2+1","v":"2019-07-18"},{"$f":"OH2+1","v":"2019-07-19"},{"$f":"OI2+1","v":"2019-07-19"},{"$f":"OJ2+1","v":"2019-07-20"},{"$f":"OK2+1","v":"2019-07-20"},{"$f":"OL2+1","v":"2019-07-21"},{"$f":"OM2+1","v":"2019-07-21"},{"$f":"ON2+1","v":"2019-07-22"},{"$f":"OO2+1","v":"2019-07-22"},{"$f":"OP2+1","v":"2019-07-23"},{"$f":"OQ2+1","v":"2019-07-23"},{"$f":"OR2+1","v":"2019-07-24"},{"$f":"OS2+1","v":"2019-07-24"},{"$f":"OT2+1","v":"2019-07-25"},{"$f":"OU2+1","v":"2019-07-25"},{"$f":"OV2+1","v":"2019-07-26"},{"$f":"OW2+1","v":"2019-07-26"},{"$f":"OX2+1","v":"2019-07-27"},{"$f":"OY2+1","v":"2019-07-27"},{"$f":"OZ2+1","v":"2019-07-28"},{"$f":"PA2+1","v":"2019-07-28"},{"$f":"PB2+1","v":"2019-07-29"},{"$f":"PC2+1","v":"2019-07-29"},{"$f":"PD2+1","v":"2019-07-30"},{"$f":"PE2+1","v":"2019-07-30"},{"$f":"PF2+1","v":"2019-07-31"},{"$f":"PG2+1","v":"2019-07-31"},{"$f":"PH2+1","v":"2019-08-01"},{"$f":"PI2+1","v":"2019-08-01"},{"$f":"PJ2+1","v":"2019-08-02"},{"$f":"PK2+1","v":"2019-08-02"},{"$f":"PL2+1","v":"2019-08-03"},{"$f":"PM2+1","v":"2019-08-03"},{"$f":"PN2+1","v":"2019-08-04"},{"$f":"PO2+1","v":"2019-08-04"},{"$f":"PP2+1","v":"2019-08-05"},{"$f":"PQ2+1","v":"2019-08-05"},{"$f":"PR2+1","v":"2019-08-06"},{"$f":"PS2+1","v":"2019-08-06"},{"$f":"PT2+1","v":"2019-08-07"},{"$f":"PU2+1","v":"2019-08-07"},{"$f":"PV2+1","v":"2019-08-08"},{"$f":"PW2+1","v":"2019-08-08"},{"$f":"PX2+1","v":"2019-08-09"},{"$f":"PY2+1","v":"2019-08-09"},{"$f":"PZ2+1","v":"2019-08-10"},{"$f":"QA2+1","v":"2019-08-10"},{"$f":"QB2+1","v":"2019-08-11"},{"$f":"QC2+1","v":"2019-08-11"},{"$f":"QD2+1","v":"2019-08-12"},{"$f":"QE2+1","v":"2019-08-12"},{"$f":"QF2+1","v":"2019-08-13"},{"$f":"QG2+1","v":"2019-08-13"},{"$f":"QH2+1","v":"2019-08-14"},{"$f":"QI2+1","v":"2019-08-14"},{"$f":"QJ2+1","v":"2019-08-15"},{"$f":"QK2+1","v":"2019-08-15"},{"$f":"QL2+1","v":"2019-08-16"},{"$f":"QM2+1","v":"2019-08-16"},"2019-08-17",{"$f":"QO2+1","v":"2019-08-17"},{"$f":"QP2+1","v":"2019-08-18"},{"$f":"QQ2+1","v":"2019-08-18"},{"$f":"QR2+1","v":"2019-08-19"},{"$f":"QS2+1","v":"2019-08-19"},{"$f":"QT2+1","v":"2019-08-20"},{"$f":"QU2+1","v":"2019-08-20"},{"$f":"QV2+1","v":"2019-08-21"},{"$f":"QW2+1","v":"2019-08-21"},{"$f":"QX2+1","v":"2019-08-22"},{"$f":"QY2+1","v":"2019-08-22"},{"$f":"QZ2+1","v":"2019-08-23"},{"$f":"RA2+1","v":"2019-08-23"},{"$f":"RB2+1","v":"2019-08-24"},{"$f":"RC2+1","v":"2019-08-24"},{"$f":"RD2+1","v":"2019-08-25"},{"$f":"RE2+1","v":"2019-08-25"},{"$f":"RF2+1","v":"2019-08-26"},{"$f":"RG2+1","v":"2019-08-26"},{"$f":"RH2+1","v":"2019-08-27"},{"$f":"RI2+1","v":"2019-08-27"},{"$f":"RJ2+1","v":"2019-08-28"},{"$f":"RK2+1","v":"2019-08-28"},{"$f":"RL2+1","v":"2019-08-29"},{"$f":"RM2+1","v":"2019-08-29"},{"$f":"RN2+1","v":"2019-08-30"},{"$f":"RO2+1","v":"2019-08-30"},{"$f":"RP2+1","v":"2019-08-31"},{"$f":"RQ2+1","v":"2019-08-31"},{"$f":"RR2+1","v":"2019-09-01"},{"$f":"RS2+1","v":"2019-09-01"},{"$f":"RT2+1","v":"2019-09-02"},{"$f":"RU2+1","v":"2019-09-02"},{"$f":"RV2+1","v":"2019-09-03"},{"$f":"RW2+1","v":"2019-09-03"},{"$f":"RX2+1","v":"2019-09-04"},{"$f":"RY2+1","v":"2019-09-04"},{"$f":"RZ2+1","v":"2019-09-05"},{"$f":"SA2+1","v":"2019-09-05"},{"$f":"SB2+1","v":"2019-09-06"},{"$f":"SC2+1","v":"2019-09-06"},{"$f":"SD2+1","v":"2019-09-07"},{"$f":"SE2+1","v":"2019-09-07"},{"$f":"SF2+1","v":"2019-09-08"},{"$f":"SG2+1","v":"2019-09-08"},{"$f":"SH2+1","v":"2019-09-09"},{"$f":"SI2+1","v":"2019-09-09"},{"$f":"SJ2+1","v":"2019-09-10"},{"$f":"SK2+1","v":"2019-09-10"},{"$f":"SL2+1","v":"2019-09-11"},{"$f":"SM2+1","v":"2019-09-11"},{"$f":"SN2+1","v":"2019-09-12"},{"$f":"SO2+1","v":"2019-09-12"},{"$f":"SP2+1","v":"2019-09-13"},{"$f":"SQ2+1","v":"2019-09-13"},{"$f":"SR2+1","v":"2019-09-14"},{"$f":"SS2+1","v":"2019-09-14"},{"$f":"ST2+1","v":"2019-09-15"},{"$f":"SU2+1","v":"2019-09-15"},{"$f":"SV2+1","v":"2019-09-16"},{"$f":"SW2+1","v":"2019-09-16"},{"$f":"SX2+1","v":"2019-09-17"},{"$f":"SY2+1","v":"2019-09-17"},{"$f":"SZ2+1","v":"2019-09-18"},{"$f":"TA2+1","v":"2019-09-18"},{"$f":"TB2+1","v":"2019-09-19"},{"$f":"TC2+1","v":"2019-09-19"},{"$f":"TD2+1","v":"2019-09-20"},{"$f":"TE2+1","v":"2019-09-20"},{"$f":"TF2+1","v":"2019-09-21"},{"$f":"TG2+1","v":"2019-09-21"},{"$f":"TH2+1","v":"2019-09-22"},{"$f":"TI2+1","v":"2019-09-22"},{"$f":"TJ2+1","v":"2019-09-23"},{"$f":"TK2+1","v":"2019-09-23"},{"$f":"TL2+1","v":"2019-09-24"},{"$f":"TM2+1","v":"2019-09-24"},{"$f":"TN2+1","v":"2019-09-25"},{"$f":"TO2+1","v":"2019-09-25"},{"$f":"TP2+1","v":"2019-09-26"},{"$f":"TQ2+1","v":"2019-09-26"},{"$f":"TR2+1","v":"2019-09-27"},{"$f":"TS2+1","v":"2019-09-27"},{"$f":"TT2+1","v":"2019-09-28"},{"$f":"TU2+1","v":"2019-09-28"},{"$f":"TV2+1","v":"2019-09-29"},{"$f":"TW2+1","v":"2019-09-29"},{"$f":"TX2+1","v":"2019-09-30"},{"$f":"TY2+1","v":"2019-09-30"},{"$f":"TZ2+1","v":"2019-10-01"},{"$f":"UA2+1","v":"2019-10-01"},{"$f":"UB2+1","v":"2019-10-02"},{"$f":"UC2+1","v":"2019-10-02"},{"$f":"UD2+1","v":"2019-10-03"},{"$f":"UE2+1","v":"2019-10-03"},{"$f":"UF2+1","v":"2019-10-04"},{"$f":"UG2+1","v":"2019-10-04"},{"$f":"UH2+1","v":"2019-10-05"},{"$f":"UI2+1","v":"2019-10-05"},{"$f":"UJ2+1","v":"2019-10-06"},{"$f":"UK2+1","v":"2019-10-06"},{"$f":"UL2+1","v":"2019-10-07"},{"$f":"UM2+1","v":"2019-10-07"},{"$f":"UN2+1","v":"2019-10-08"},{"$f":"UO2+1","v":"2019-10-08"},{"$f":"UP2+1","v":"2019-10-09"},{"$f":"UQ2+1","v":"2019-10-09"},{"$f":"UR2+1","v":"2019-10-10"},{"$f":"US2+1","v":"2019-10-10"},{"$f":"UT2+1","v":"2019-10-11"},{"$f":"UU2+1","v":"2019-10-11"},{"$f":"UV2+1","v":"2019-10-12"},{"$f":"UW2+1","v":"2019-10-12"},{"$f":"UX2+1","v":"2019-10-13"},{"$f":"UY2+1","v":"2019-10-13"},{"$f":"UZ2+1","v":"2019-10-14"},{"$f":"VA2+1","v":"2019-10-14"},{"$f":"VB2+1","v":"2019-10-15"},{"$f":"VC2+1","v":"2019-10-15"},{"$f":"VD2+1","v":"2019-10-16"},{"$f":"VE2+1","v":"2019-10-16"},{"$f":"VF2+1","v":"2019-10-17"},{"$f":"VG2+1","v":"2019-10-17"},{"$f":"VH2+1","v":"2019-10-18"},{"$f":"VI2+1","v":"2019-10-18"},{"$f":"VJ2+1","v":"2019-10-19"},{"$f":"VK2+1","v":"2019-10-19"},{"$f":"VL2+1","v":"2019-10-20"},{"$f":"VM2+1","v":"2019-10-20"},{"$f":"VN2+1","v":"2019-10-21"},{"$f":"VO2+1","v":"2019-10-21"},{"$f":"VP2+1","v":"2019-10-22"},{"$f":"VQ2+1","v":"2019-10-22"},{"$f":"VR2+1","v":"2019-10-23"},{"$f":"VS2+1","v":"2019-10-23"},{"$f":"VT2+1","v":"2019-10-24"},{"$f":"VU2+1","v":"2019-10-24"},{"$f":"VV2+1","v":"2019-10-25"},{"$f":"VW2+1","v":"2019-10-25"},{"$f":"VX2+1","v":"2019-10-26"},{"$f":"VY2+1","v":"2019-10-26"},{"$f":"VZ2+1","v":"2019-10-27"},{"$f":"WA2+1","v":"2019-10-27"},{"$f":"WB2+1","v":"2019-10-28"},{"$f":"WC2+1","v":"2019-10-28"},{"$f":"WD2+1","v":"2019-10-29"},{"$f":"WE2+1","v":"2019-10-29"},{"$f":"WF2+1","v":"2019-10-30"},{"$f":"WG2+1","v":"2019-10-30"},{"$f":"WH2+1","v":"2019-10-31"},"2019-10-31",{"$f":"WJ2+1","v":"2019-11-01"},{"$f":"WK2+1","v":"2019-11-01"},{"$f":"WL2+1","v":"2019-11-02"},{"$f":"WM2+1","v":"2019-11-02"},{"$f":"WN2+1","v":"2019-11-03"},{"$f":"WO2+1","v":"2019-11-03"},{"$f":"WP2+1","v":"2019-11-04"},{"$f":"WQ2+1","v":"2019-11-04"},{"$f":"WR2+1","v":"2019-11-05"},{"$f":"WS2+1","v":"2019-11-05"},{"$f":"WT2+1","v":"2019-11-06"},{"$f":"WU2+1","v":"2019-11-06"},{"$f":"WV2+1","v":"2019-11-07"},{"$f":"WW2+1","v":"2019-11-07"},{"$f":"WX2+1","v":"2019-11-08"},{"$f":"WY2+1","v":"2019-11-08"},{"$f":"WZ2+1","v":"2019-11-09"},{"$f":"XA2+1","v":"2019-11-09"},{"$f":"XB2+1","v":"2019-11-10"},{"$f":"XC2+1","v":"2019-11-10"},{"$f":"XD2+1","v":"2019-11-11"},{"$f":"XE2+1","v":"2019-11-11"},{"$f":"XF2+1","v":"2019-11-12"},{"$f":"XG2+1","v":"2019-11-12"},{"$f":"XH2+1","v":"2019-11-13"},{"$f":"XI2+1","v":"2019-11-13"},{"$f":"XJ2+1","v":"2019-11-14"},{"$f":"XK2+1","v":"2019-11-14"},{"$f":"XL2+1","v":"2019-11-15"},{"$f":"XM2+1","v":"2019-11-15"},{"$f":"XN2+1","v":"2019-11-16"},{"$f":"XO2+1","v":"2019-11-16"},{"$f":"XP2+1","v":"2019-11-17"},{"$f":"XQ2+1","v":"2019-11-17"},{"$f":"XR2+1","v":"2019-11-18"},{"$f":"XS2+1","v":"2019-11-18"},{"$f":"XT2+1","v":"2019-11-19"},{"$f":"XU2+1","v":"2019-11-19"},{"$f":"XV2+1","v":"2019-11-20"},{"$f":"XW2+1","v":"2019-11-20"},{"$f":"XX2+1","v":"2019-11-21"},{"$f":"XY2+1","v":"2019-11-21"},{"$f":"XZ2+1","v":"2019-11-22"},{"$f":"YA2+1","v":"2019-11-22"},{"$f":"YB2+1","v":"2019-11-23"},{"$f":"YC2+1","v":"2019-11-23"},{"$f":"YD2+1","v":"2019-11-24"},{"$f":"YE2+1","v":"2019-11-24"},{"$f":"YF2+1","v":"2019-11-25"},{"$f":"YG2+1","v":"2019-11-25"},{"$f":"YH2+1","v":"2019-11-26"},{"$f":"YI2+1","v":"2019-11-26"},{"$f":"YJ2+1","v":"2019-11-27"},{"$f":"YK2+1","v":"2019-11-27"},{"$f":"YL2+1","v":"2019-11-28"},{"$f":"YM2+1","v":"2019-11-28"},{"$f":"YN2+1","v":"2019-11-29"},{"$f":"YO2+1","v":"2019-11-29"},{"$f":"YP2+1","v":"2019-11-30"},{"$f":"YQ2+1","v":"2019-11-30"},{"$f":"YR2+1","v":"2019-12-01"},{"$f":"YS2+1","v":"2019-12-01"},{"$f":"YT2+1","v":"2019-12-02"},{"$f":"YU2+1","v":"2019-12-02"},{"$f":"YV2+1","v":"2019-12-03"},{"$f":"YW2+1","v":"2019-12-03"},{"$f":"YX2+1","v":"2019-12-04"},{"$f":"YY2+1","v":"2019-12-04"},{"$f":"YZ2+1","v":"2019-12-05"},{"$f":"ZA2+1","v":"2019-12-05"},{"$f":"ZB2+1","v":"2019-12-06"},{"$f":"ZC2+1","v":"2019-12-06"},{"$f":"ZD2+1","v":"2019-12-07"},{"$f":"ZE2+1","v":"2019-12-07"},{"$f":"ZF2+1","v":"2019-12-08"},{"$f":"ZG2+1","v":"2019-12-08"},{"$f":"ZH2+1","v":"2019-12-09"},{"$f":"ZI2+1","v":"2019-12-09"},{"$f":"ZJ2+1","v":"2019-12-10"},{"$f":"ZK2+1","v":"2019-12-10"},{"$f":"ZL2+1","v":"2019-12-11"},{"$f":"ZM2+1","v":"2019-12-11"},{"$f":"ZN2+1","v":"2019-12-12"},{"$f":"ZO2+1","v":"2019-12-12"},{"$f":"ZP2+1","v":"2019-12-13"},{"$f":"ZQ2+1","v":"2019-12-13"},{"$f":"ZR2+1","v":"2019-12-14"},{"$f":"ZS2+1","v":"2019-12-14"},{"$f":"ZT2+1","v":"2019-12-15"},{"$f":"ZU2+1","v":"2019-12-15"},{"$f":"ZV2+1","v":"2019-12-16"},{"$f":"ZW2+1","v":"2019-12-16"},{"$f":"ZX2+1","v":"2019-12-17"},{"$f":"ZY2+1","v":"2019-12-17"},{"$f":"ZZ2+1","v":"2019-12-18"},{"$f":"AAA2+1","v":"2019-12-18"},{"$f":"AAB2+1","v":"2019-12-19"},{"$f":"AAC2+1","v":"2019-12-19"},{"$f":"AAD2+1","v":"2019-12-20"},{"$f":"AAE2+1","v":"2019-12-20"},{"$f":"AAF2+1","v":"2019-12-21"},{"$f":"AAG2+1","v":"2019-12-21"},{"$f":"AAH2+1","v":"2019-12-22"},{"$f":"AAI2+1","v":"2019-12-22"},{"$f":"AAJ2+1","v":"2019-12-23"},{"$f":"AAK2+1","v":"2019-12-23"},{"$f":"AAL2+1","v":"2019-12-24"},{"$f":"AAM2+1","v":"2019-12-24"},{"$f":"AAN2+1","v":"2019-12-25"},{"$f":"AAO2+1","v":"2019-12-25"},{"$f":"AAP2+1","v":"2019-12-26"},{"$f":"AAQ2+1","v":"2019-12-26"},{"$f":"AAR2+1","v":"2019-12-27"},{"$f":"AAS2+1","v":"2019-12-27"},{"$f":"AAT2+1","v":"2019-12-28"},{"$f":"AAU2+1","v":"2019-12-28"},{"$f":"AAV2+1","v":"2019-12-29"},{"$f":"AAW2+1","v":"2019-12-29"},{"$f":"AAX2+1","v":"2019-12-30"},{"$f":"AAY2+1","v":"2019-12-30"},{"$f":"AAZ2+1","v":"2019-12-31"},{"$f":"ABA2+1","v":"2019-12-31"},{"$f":"ABB2+1","v":"2020-01-01"},{"$f":"ABC2+1","v":"2020-01-01"},{"$f":"ABD2+1","v":"2020-01-02"},{"$f":"ABE2+1","v":"2020-01-02"},{"$f":"ABF2+1","v":"2020-01-03"},{"$f":"ABG2+1","v":"2020-01-03"},{"$f":"ABH2+1","v":"2020-01-04"},{"$f":"ABI2+1","v":"2020-01-04"}]
[null,{"$f":"DATE(Année,1,1)","v":"2019-01-01"},{"$f":"B3","v":"2019-01-01"},{"$f":"B3+1","v":"2019-01-02"},{"$f":"C3+1","v":"2019-01-02"},"2019-01-03","2019-01-03","2019-01-04","2019-01-04","2019-01-05","2019-01-05","2019-01-06","2019-01-06","2019-01-07","2019-01-07","2019-01-08","2019-01-08","2019-01-09","2019-01-09","2019-01-10","2019-01-10","2019-01-11","2019-01-11","2019-01-12","2019-01-12","2019-01-13","2019-01-13","2019-01-14","2019-01-14","2019-01-15","2019-01-15","2019-01-16","2019-01-16","2019-01-17","2019-01-17","2019-01-18","2019-01-18","2019-01-19","2019-01-19","2019-01-20","2019-01-20","2019-01-21","2019-01-21","2019-01-22","2019-01-22","2019-01-23","2019-01-23","2019-01-24","2019-01-24","2019-01-25","2019-01-25","2019-01-26","2019-01-26","2019-01-27","2019-01-27","2019-01-28","2019-01-28","2019-01-29","2019-01-29","2019-01-30","2019-01-30","2019-01-31","2019-01-31","2019-02-01","2019-02-01","2019-02-02","2019-02-02","2019-02-03","2019-02-03","2019-02-04","2019-02-04","2019-02-05","2019-02-05","2019-02-06","2019-02-06","2019-02-07","2019-02-07","2019-02-08","2019-02-08","2019-02-09","2019-02-09","2019-02-10","2019-02-10","2019-02-11","2019-02-11","2019-02-12","2019-02-12","2019-02-13","2019-02-13","2019-02-14","2019-02-14","2019-02-15","2019-02-15","2019-02-16","2019-02-16","2019-02-17","2019-02-17","2019-02-18","2019-02-18","2019-02-19","2019-02-19","2019-02-20","2019-02-20","2019-02-21","2019-02-21","2019-02-22","2019-02-22","2019-02-23","2019-02-23","2019-02-24","2019-02-24","2019-02-25","2019-02-25","2019-02-26","2019-02-26","2019-02-27","2019-02-27","2019-02-28","2019-02-28","2019-03-01","2019-03-01","2019-03-02","2019-03-02","2019-03-03","2019-03-03","2019-03-04","2019-03-04","2019-03-05","2019-03-05","2019-03-06","2019-03-06","2019-03-07","2019-03-07","2019-03-08","2019-03-08","2019-03-09","2019-03-09","2019-03-10","2019-03-10","2019-03-11","2019-03-11","2019-03-12","2019-03-12","2019-03-13","2019-03-13","2019-03-14","2019-03-14","2019-03-15","2019-03-15","2019-03-16","2019-03-16","2019-03-17","2019-03-17","2019-03-18","2019-03-18","2019-03-19","2019-03-19","2019-03-20","2019-03-20","2019-03-21","2019-03-21","2019-03-22","2019-03-22","2019-03-23","2019-03-23","2019-03-24","2019-03-24","2019-03-25","2019-03-25","2019-03-26","2019-03-26","2019-03-27","2019-03-27","2019-03-28","2019-03-28","2019-03-29","2019-03-29","2019-03-30","2019-03-30","2019-03-31","2019-03-31","2019-04-01","2019-04-01","2019-04-02","2019-04-02","2019-04-03","2019-04-03","2019-04-04","2019-04-04","2019-04-05","2019-04-05","2019-04-06","2019-04-06","2019-04-07","2019-04-07","2019-04-08","2019-04-08","2019-04-09","2019-04-09","2019-04-10","2019-04-10","2019-04-11","2019-04-11","2019-04-12","2019-04-12","2019-04-13","2019-04-13","2019-04-14","2019-04-14","2019-04-15","2019-04-15","2019-04-16","2019-04-16","2019-04-17","2019-04-17","2019-04-18","2019-04-18","2019-04-19","2019-04-19","2019-04-20","2019-04-20","2019-04-21","2019-04-21","2019-04-22","2019-04-22","2019-04-23","2019-04-23","2019-04-24","2019-04-24","2019-04-25","2019-04-25","2019-04-26","2019-04-26","2019-04-27","2019-04-27","2019-04-28","2019-04-28","2019-04-29","2019-04-29","2019-04-30","2019-04-30","2019-05-01","2019-05-01","2019-05-02","2019-05-02","2019-05-03","2019-05-03","2019-05-04","2019-05-04","2019-05-05","2019-05-05","2019-05-06","2019-05-06","2019-05-07","2019-05-07","2019-05-08","2019-05-08","2019-05-09","2019-05-09","2019-05-10","2019-05-10","2019-05-11","2019-05-11","2019-05-12","2019-05-12","2019-05-13","2019-05-13","2019-05-14","2019-05-14","2019-05-15","2019-05-15","2019-05-16","2019-05-16","2019-05-17","2019-05-17","2019-05-18","2019-05-18","2019-05-19","2019-05-19","2019-05-20","2019-05-20","2019-05-21","2019-05-21","2019-05-22","2019-05-22","2019-05-23","2019-05-23","2019-05-24","2019-05-24","2019-05-25","2019-05-25","2019-05-26","2019-05-26","2019-05-27","2019-05-27","2019-05-28","2019-05-28","2019-05-29","2019-05-29","2019-05-30","2019-05-30","2019-05-31","2019-05-31","2019-06-01","2019-06-01","2019-06-02","2019-06-02","2019-06-03","2019-06-03","2019-06-04","2019-06-04","2019-06-05","2019-06-05","2019-06-06","2019-06-06","2019-06-07","2019-06-07","2019-06-08","2019-06-08","2019-06-09","2019-06-09","2019-06-10","2019-06-10","2019-06-11","2019-06-11","2019-06-12","2019-06-12","2019-06-13","2019-06-13","2019-06-14","2019-06-14","2019-06-15","2019-06-15","2019-06-16","2019-06-16","2019-06-17","2019-06-17","2019-06-18","2019-06-18","2019-06-19","2019-06-19","2019-06-20","2019-06-20","2019-06-21","2019-06-21","2019-06-22","2019-06-22","2019-06-23","2019-06-23","2019-06-24","2019-06-24","2019-06-25","2019-06-25","2019-06-26","2019-06-26","2019-06-27","2019-06-27","2019-06-28","2019-06-28","2019-06-29","2019-06-29","2019-06-30","2019-06-30","2019-07-01","2019-07-01","2019-07-02","2019-07-02","2019-07-03","2019-07-03","2019-07-04","2019-07-04","2019-07-05","2019-07-05","2019-07-06","2019-07-06","2019-07-07","2019-07-07","2019-07-08","2019-07-08","2019-07-09","2019-07-09","2019-07-10","2019-07-10","2019-07-11","2019-07-11","2019-07-12","2019-07-12","2019-07-13","2019-07-13","2019-07-14","2019-07-14","2019-07-15","2019-07-15","2019-07-16","2019-07-16","2019-07-17","2019-07-17","2019-07-18","2019-07-18","2019-07-19","2019-07-19","2019-07-20","2019-07-20","2019-07-21","2019-07-21","2019-07-22","2019-07-22","2019-07-23","2019-07-23","2019-07-24","2019-07-24","2019-07-25","2019-07-25","2019-07-26","2019-07-26","2019-07-27","2019-07-27","2019-07-28","2019-07-28","2019-07-29","2019-07-29","2019-07-30","2019-07-30","2019-07-31","2019-07-31","2019-08-01","2019-08-01","2019-08-02","2019-08-02","2019-08-03","2019-08-03","2019-08-04","2019-08-04","2019-08-05","2019-08-05","2019-08-06","2019-08-06","2019-08-07","2019-08-07","2019-08-08","2019-08-08","2019-08-09","2019-08-09","2019-08-10","2019-08-10","2019-08-11","2019-08-11","2019-08-12","2019-08-12","2019-08-13","2019-08-13","2019-08-14","2019-08-14","2019-08-15","2019-08-15","2019-08-16","2019-08-16","2019-08-17","2019-08-17","2019-08-18","2019-08-18","2019-08-19","2019-08-19","2019-08-20","2019-08-20","2019-08-21","2019-08-21","2019-08-22","2019-08-22","2019-08-23","2019-08-23","2019-08-24","2019-08-24","2019-08-25","2019-08-25","2019-08-26","2019-08-26","2019-08-27","2019-08-27","2019-08-28","2019-08-28","2019-08-29","2019-08-29","2019-08-30","2019-08-30","2019-08-31","2019-08-31","2019-09-01","2019-09-01","2019-09-02","2019-09-02","2019-09-03","2019-09-03","2019-09-04","2019-09-04","2019-09-05","2019-09-05","2019-09-06","2019-09-06","2019-09-07","2019-09-07","2019-09-08","2019-09-08","2019-09-09","2019-09-09","2019-09-10","2019-09-10","2019-09-11","2019-09-11","2019-09-12","2019-09-12","2019-09-13","2019-09-13","2019-09-14","2019-09-14","2019-09-15","2019-09-15","2019-09-16","2019-09-16","2019-09-17","2019-09-17","2019-09-18","2019-09-18","2019-09-19","2019-09-19","2019-09-20","2019-09-20","2019-09-21","2019-09-21","2019-09-22","2019-09-22","2019-09-23","2019-09-23","2019-09-24","2019-09-24","2019-09-25","2019-09-25","2019-09-26","2019-09-26","2019-09-27","2019-09-27","2019-09-28","2019-09-28","2019-09-29","2019-09-29","2019-09-30","2019-09-30","2019-10-01","2019-10-01","2019-10-02","2019-10-02","2019-10-03","2019-10-03","2019-10-04","2019-10-04","2019-10-05","2019-10-05","2019-10-06","2019-10-06","2019-10-07","2019-10-07","2019-10-08","2019-10-08","2019-10-09","2019-10-09","2019-10-10","2019-10-10","2019-10-11","2019-10-11","2019-10-12","2019-10-12","2019-10-13","2019-10-13","2019-10-14","2019-10-14","2019-10-15","2019-10-15","2019-10-16","2019-10-16","2019-10-17","2019-10-17","2019-10-18","2019-10-18","2019-10-19","2019-10-19","2019-10-20","2019-10-20","2019-10-21","2019-10-21","2019-10-22","2019-10-22","2019-10-23","2019-10-23","2019-10-24","2019-10-24","2019-10-25","2019-10-25","2019-10-26","2019-10-26","2019-10-27","2019-10-27","2019-10-28","2019-10-28","2019-10-29","2019-10-29","2019-10-30","2019-10-30","2019-10-31","2019-10-31","2019-11-01","2019-11-01","2019-11-02","2019-11-02","2019-11-03","2019-11-03","2019-11-04","2019-11-04","2019-11-05","2019-11-05","2019-11-06","2019-11-06","2019-11-07","2019-11-07","2019-11-08","2019-11-08","2019-11-09","2019-11-09","2019-11-10","2019-11-10","2019-11-11","2019-11-11","2019-11-12","2019-11-12","2019-11-13","2019-11-13","2019-11-14","2019-11-14","2019-11-15","2019-11-15","2019-11-16","2019-11-16","2019-11-17","2019-11-17","2019-11-18","2019-11-18","2019-11-19","2019-11-19","2019-11-20","2019-11-20","2019-11-21","2019-11-21","2019-11-22","2019-11-22","2019-11-23","2019-11-23","2019-11-24","2019-11-24","2019-11-25","2019-11-25","2019-11-26","2019-11-26","2019-11-27","2019-11-27","2019-11-28","2019-11-28","2019-11-29","2019-11-29","2019-11-30","2019-11-30","2019-12-01","2019-12-01","2019-12-02","2019-12-02","2019-12-03","2019-12-03","2019-12-04","2019-12-04","2019-12-05","2019-12-05","2019-12-06","2019-12-06","2019-12-07","2019-12-07","2019-12-08","2019-12-08","2019-12-09","2019-12-09","2019-12-10","2019-12-10","2019-12-11","2019-12-11","2019-12-12","2019-12-12","2019-12-13","2019-12-13","2019-12-14","2019-12-14","2019-12-15","2019-12-15","2019-12-16","2019-12-16","2019-12-17","2019-12-17","2019-12-18","2019-12-18","2019-12-19","2019-12-19","2019-12-20","2019-12-20","2019-12-21","2019-12-21","2019-12-22","2019-12-22","2019-12-23","2019-12-23","2019-12-24","2019-12-24","2019-12-25","2019-12-25","2019-12-26","2019-12-26","2019-12-27","2019-12-27","2019-12-28","2019-12-28","2019-12-29","2019-12-29","2019-12-30","2019-12-30","2019-12-31","2019-12-31","2020-01-01","2020-01-01","2020-01-02","2020-01-02","2020-01-03","2020-01-03","2020-01-04","2020-01-04"]
[null,"M","A","M","A","M","A","M","A","M","A","M","A","M","A","M","A","M","A","M","A","M","A","M","A","M","A","M","A","M","A","M","A","M","A","M","A","M","A","M","A","M","A","M","A","M","A","M","A","M","A","M","A","M","A","M","A","M","A","M","A","M","A","M","A","M","A","M","A","M","A","M","A","M","A","M","A","M","A","M","A","M","A","M","A","M","A","M","A","M","A","M","A","M","A","M","A","M","A","M","A","M","A","M","A","M","A","M","A","M","A","M","A","M","A","M","A","M","A","M","A","M","A","M","A","M","A","M","A","M","A","M","A","M","A","M","A","M","A","M","A","M","A","M","A","M","A","M","A","M","A","M","A","M","A","M","A","M","A","M","A","M","A","M","A","M","A","M","A","M","A","M","A","M","A","M","A","M","A","M","A","M","A","M","A","M","A","M","A","M","A","M","A","M","A","M","A","M","A","M","A","M","A","M","A","M","A","M","A","M","A","M","A","M","A","M","A","M","A","M","A","M","A","M","A","M","A","M","A","M","A","M","A","M","A","M","A","M","A","M","A","M","A","M","A","M","A","M","A","M","A","M","A","M","A","M","A","M","A","M","A","M","A","M","A","M","A","M","A","M","A","M","A","M","A","M","A","M","A","M","A","M","A","M","A","M","A","M","A","M","A","M","A","M","A","M","A","M","A","M","A","M","A","M","A","M","A","M","A","M","A","M","A","M","A","M","A","M","A","M","A","M","A","M","A","M","A","M","A","M","A","M","A","M","A","M","A","M","A","M","A","M","A","M","A","M","A","M","A","M","A","M","A","M","A","M","A","M","A","M","A","M","A","M","A","M","A","M","A","M","A","M","A","M","A","M","A","M","A","M","A","M","A","M","A","M","A","M","A","M","A","M","A","M","A","M","A","M","A","M","A","M","A","M","A","M","A","M","A","M","A","M","A","M","A","M","A","M","A","M","A","M","A","M","A","M","A","M","A","M","A","M","A","M","A","M","A","M","A","M","A","M","A","M","A","M","A","M","A","M","A","M","A","M","A","M","A","M","A","M","A","M","A","M","A","M","A","M","A","M","A","M","A","M","A","M","A","M","A","M","A","M","A","M","A","M","A","M","A","M","A","M","A","M","A","M","A","M","A","M","A","M","A","M","A","M","A","M","A","M","A","M","A","M","A","M","A","M","A","M","A","M","A","M","A","M","A","M","A","M","A","M","A","M","A","M","A","M","A","M","A","M","A","M","A","M","A","M","A","M","A","M","A","M","A","M","A","M","A","M","A","M","A","M","A","M","A","M","A","M","A","M","A","M","A","M","A","M","A","M","A","M","A","M","A","M","A","M","A","M","A","M","A","M","A","M","A","M","A","M","A","M","A","M","A","M","A","M","A","M","A","M","A","M","A","M","A","M","A","M","A","M","A","M","A","M","A","M","A","M","A","M","A","M","A","M","A","M","A","M","A","M","A","M","A","M","A","M","A","M","A","M","A","M","A","M","A","M","A","M","A","M","A","M","A","M","A","M","A","M","A","M","A","M","A","M","A","M","A","M","A","M","A","M","A","M","A","M","A","M","A","M","A","M","A","M","A","M","A","M","A","M","A","M","A","M","A","M","A","M","A","M","A","M","A","M","A","M","A","M","A","M","A","M","A","M","A","M","A","M","A","M","A","M","A","M","A","M","A"]
["Balu","CP","Mat",{"$nulls":10},"CP","CP","CP","CP","CP","CP","CP","CP","CP","CP",{"$nulls":6},"CP","CP","CP","CP","CP","CP","CP","CP",{"$nulls":4},"Cpa","Cpa","Cpa","Cpa","Cpa","Cpa","Cpa","Cpa","Cpa","Cpa"]
["Dupond",null,"CP",{"$nulls":10},"Cpa","Cpa","Cpa","Cpa",{"$nulls":16},"Mal","Mal","Mal","Mal"]
["Bernier",null,null,"CP"]
["Bisson","CP","CP","CP","CP","CP","CP","CP","CP",{"$nulls":7},"CP"]
["Dupont"]
["Durand"]
["Durandal"]
["Magdalou"]
["Magnier"]
["Martin"]
["Martinet"]
["Mazoni"]
["Mercier"]
["Miroux"]
["Nicolas"]
["Tantucci"]
["."]
["."]
["."]
["."]

{"sheet":"Fériés","index":2,"n_rows":12,"n_cols":5,"rows_kept":12}
["Année",null,"Fériés",null,"Pâques"]
[2019,null,{"$f":"DATE(A2,1,1)","v":"2019-01-01"},null,{"$f":"ROUND(DATE(Année,4,MOD(234-11*MOD(Année,19),30))/7,0)*7-6","v":"2019-04-21"}]
[null,null,{"$f":"DATE(A2,5,1)","v":"2019-05-01"}]
[null,null,{"$f":"DATE(A2,5,8)","v":"2019-05-08"}]
[null,null,{"$f":"DATE(A2,7,14)","v":"2019-07-14"}]
[null,null,{"$f":"DATE(A2,8,15)","v":"2019-08-15"}]
[null,null,{"$f":"DATE(A2,11,1)","v":"2019-11-01"}]
[null,null,{"$f":"DATE(A2,11,11)","v":"2019-11-11"}]
[null,null,{"$f":"DATE(A2,12,25)","v":"2019-12-25"}]
[null,null,{"$f":"E2+1","v":"2019-04-22"}]
[null,null,{"$f":"E2+39","v":"2019-05-30"}]
[null,null,{"$f":"E2+50","v":"2019-06-10"}]

{"sheet":"ParamètresCouleurs","index":3,"n_rows":12,"n_cols":23,"rows_kept":12}
[{"$nulls":17},"Accueil"]
[]
[]
["Couleurs"]
["CP","Mal","Mat","Evf","Cpa","AbsNR","Cpat","Dj"]
["Congés","Maladie","Maternité","Evnt. Familial","Congé Parental","Absence non rému.","Congé Paternité","Demi-journée",{"$nulls":13},"Noms de champ"]
[{"$nulls":21},"Année","=Fériés!$A$2"]
[{"$nulls":21},"Congés","=ParamètresCouleurs!$A$5:$Q$5"]
[{"$nulls":21},"CongésSem","=Plan!$B$4:$NN$23"]
[{"$nulls":21},"fériés","=Fériés!$C$2:$C$12"]
[{"$nulls":21},"MesCouleurs","=ParamètresCouleurs!$A$5:$Q$5"]
[{"$nulls":21},"MotifsCongés","=ParamètresCouleurs!$A$6:$Q$6"]

{"sheet":"Couleurs","index":4,"n_rows":2,"n_cols":9,"rows_kept":2}
[]
[{"$nulls":8},"Généré automatiquement à partir de paramètresCouleurs"]

{"sheet":"modèle","index":5,"n_rows":117,"n_cols":229,"rows_kept":117}
[]
[]
[null,null,{"$f":"NOW()","v":"2019-04-05T20:01:37.330"}]
[]
[null,null,"Nom"]
[]
[{"$nulls":4},{"$f":"MotifsCongés","v":"Congés"},"Maladie","Maternité","Evnt. Familial","Congé Parental","Absence non rému.","Congé Paternité","Demi-journée"]
[null,null,"Date début","Date fin",{"$f":"Congés","v":"CP"},"Mal","Mat","Evf","Cpa","AbsNR","Cpat","Dj"]
{"$rows_empty":16}
[{"$nulls":4},{"$f":"SUM(E9:E24)","v":0},0,0,0,0,0,0,0]
{"$rows_empty":12}
[{"$nulls":70},"n"]
[{"$nulls":69},"2002-01-07","2002-01-08",null,"n"]
[{"$nulls":71},"2002-01-07","2002-01-08",null,"n"]
[{"$nulls":73},"2002-01-07","2002-01-08",null,"n"]
[{"$nulls":75},"2002-01-07","2002-01-08",null,"n"]
[{"$nulls":77},"2002-01-07","2002-01-08",null,"n"]
[{"$nulls":79},"2002-01-07","2002-01-08",null,"n"]
[{"$nulls":81},"2002-01-07","2002-01-08",null,"n"]
[{"$nulls":83},"2002-01-07","2002-01-08",null,"n"]
[{"$nulls":85},"2002-01-07","2002-01-08",null,"n"]
[{"$nulls":87},"2002-01-07","2002-01-08",null,"n"]
[{"$nulls":89},"2002-01-07","2002-01-08",null,"n"]
[{"$nulls":91},"2002-01-07","2002-01-08",null,"n"]
[{"$nulls":93},"2002-01-07","2002-01-08",null,"n"]
[{"$nulls":95},"2002-01-07","2002-01-08",null,"n"]
[{"$nulls":97},"2002-01-07","2002-01-08",null,"n"]
[{"$nulls":99},"2002-01-07","2002-01-08",null,"n"]
[{"$nulls":101},"2002-01-07","2002-01-08",null,"n"]
[{"$nulls":103},"2002-01-07","2002-01-08",null,"n"]
[{"$nulls":105},"2002-01-07","2002-01-08",null,"n"]
[{"$nulls":107},"2002-01-07","2002-01-08",null,"n"]
[{"$nulls":109},"2002-01-07","2002-01-08",null,"n"]
[{"$nulls":111},"2002-01-07","2002-01-08",null,"n"]
[{"$nulls":113},"2002-01-07","2002-01-08",null,"n"]
[{"$nulls":115},"2002-01-07","2002-01-08",null,"n"]
[{"$nulls":117},"2002-01-07","2002-01-08",null,"n"]
[{"$nulls":119},"2002-01-07","2002-01-08",null,"n"]
[{"$nulls":121},"2002-01-07","2002-01-08",null,"n"]
[{"$nulls":123},"2002-01-07","2002-01-08",null,"n"]
[{"$nulls":125},"2002-01-07","2002-01-08",null,"n"]
[{"$nulls":127},"2002-01-07","2002-01-08",null,"n"]
[{"$nulls":129},"2002-01-07","2002-01-08",null,"n"]
[{"$nulls":131},"2002-01-07","2002-01-08",null,"n"]
[{"$nulls":133},"2002-01-07","2002-01-08",null,"n"]
[{"$nulls":135},"2002-01-07","2002-01-08",null,"n"]
[{"$nulls":137},"2002-01-07","2002-01-08",null,"n"]
[{"$nulls":139},"2002-01-07","2002-01-08",null,"n"]
[{"$nulls":141},"2002-01-07","2002-01-08",null,"n"]
[{"$nulls":143},"2002-01-07","2002-01-08",null,"n"]
[{"$nulls":145},"2002-01-07","2002-01-08",null,"n"]
[{"$nulls":147},"2002-01-07","2002-01-08",null,"n"]
[{"$nulls":149},"2002-01-07","2002-01-08",null,"n"]
[{"$nulls":151},"2002-01-07","2002-01-08",null,"n"]
[{"$nulls":153},"2002-01-07","2002-01-08",null,"n"]
[{"$nulls":155},"2002-01-07","2002-01-08",null,"n"]
[{"$nulls":157},"2002-01-07","2002-01-08",null,"n"]
[{"$nulls":159},"2002-01-07","2002-01-08",null,"n"]
[{"$nulls":161},"2002-01-07","2002-01-08",null,"n"]
[{"$nulls":163},"2002-01-07","2002-01-08",null,"n"]
[{"$nulls":165},"2002-01-07","2002-01-08",null,"n"]
[{"$nulls":167},"2002-01-07","2002-01-08",null,"n"]
[{"$nulls":169},"2002-01-07","2002-01-08",null,"n"]
[{"$nulls":171},"2002-01-07","2002-01-08",null,"n"]
[{"$nulls":173},"2002-01-07","2002-01-08",null,"n"]
[{"$nulls":175},"2002-01-07","2002-01-08",null,"n"]
[{"$nulls":177},"2002-01-07","2002-01-08",null,"n"]
[{"$nulls":179},"2002-01-07","2002-01-08",null,"n"]
[{"$nulls":181},"2002-01-07","2002-01-08",null,"n"]
[{"$nulls":183},"2002-01-07","2002-01-08",null,"n"]
[{"$nulls":185},"2002-01-07","2002-01-08",null,"n"]
[{"$nulls":187},"2002-01-07","2002-01-08",null,"n"]
[{"$nulls":189},"2002-01-07","2002-01-08",null,"n"]
[{"$nulls":191},"2002-01-07","2002-01-08",null,"n"]
[{"$nulls":193},"2002-01-07","2002-01-08",null,"n"]
[{"$nulls":195},"2002-01-07","2002-01-08",null,"n"]
[{"$nulls":197},"2002-01-07","2002-01-08",null,"n"]
[{"$nulls":199},"2002-01-07","2002-01-08",null,"n"]
[{"$nulls":201},"2002-01-07","2002-01-08",null,"n"]
[{"$nulls":203},"2002-01-07","2002-01-08",null,"n"]
[{"$nulls":205},"2002-01-07","2002-01-08",null,"n"]
[{"$nulls":207},"2002-01-07","2002-01-08",null,"n"]
[{"$nulls":209},"2002-01-07","2002-01-08",null,"n"]
[{"$nulls":211},"2002-01-07","2002-01-08",null,"n"]
[{"$nulls":213},"2002-01-07","2002-01-08",null,"n"]
[{"$nulls":215},"2002-01-07","2002-01-08",null,"n"]
[{"$nulls":217},"2002-01-07","2002-01-08",null,"n"]
[{"$nulls":219},"2002-01-07","2002-01-08",null,"n"]
[{"$nulls":221},"2002-01-07","2002-01-08",null,"n"]
[{"$nulls":223},"2002-01-07","2002-01-08",null,"n"]
[{"$nulls":225},"2002-01-07","2002-01-08",null,"n"]

{"sheet":"F_Balu","index":6,"n_rows":117,"n_cols":229,"rows_kept":117}
[]
[]
[null,null,{"$f":"NOW()","v":"2019-04-05T20:01:37.330"}]
[]
[null,null,"Nom","Balu"]
[]
[{"$nulls":4},"Congés","Maladie","Maternité","Evnt. Familial","Congé Parental","Absence non rému.","Congé Paternité","Demi-journée"]
[null,null,"Date début","Date fin","CP","Mal","Mat","Evf","Cpa","AbsNR","Cpat","Dj"]
[null,null,"2019-01-01","2019-01-01",{"$nulls":3},0.5]
[null,null,"2019-01-02","2019-01-02",0.5]
[null,null,"2019-01-07","2019-01-08",2]
[null,null,"2019-01-09","2019-01-11",null,null,3]
[null,null,"2019-01-14","2019-01-14",{"$nulls":4},1]
[null,null,"2019-01-21","2019-01-25",{"$nulls":4},5]
{"$rows_empty":10}
[{"$nulls":4},{"$f":"SUM(E9:E24)","v":2.5},0,3,0.5,6,0,0,0]
{"$rows_empty":12}
[{"$nulls":70},"n"]
[{"$nulls":69},"2002-01-07","2002-01-08",null,"n"]
[{"$nulls":71},"2002-01-07","2002-01-08",null,"n"]
[{"$nulls":73},"2002-01-07","2002-01-08",null,"n"]
[{"$nulls":75},"2002-01-07","2002-01-08",null,"n"]
[{"$nulls":77},"2002-01-07","2002-01-08",null,"n"]
[{"$nulls":79},"2002-01-07","2002-01-08",null,"n"]
[{"$nulls":81},"2002-01-07","2002-01-08",null,"n"]
[{"$nulls":83},"2002-01-07","2002-01-08",null,"n"]
[{"$nulls":85},"2002-01-07","2002-01-08",null,"n"]
[{"$nulls":87},"2002-01-07","2002-01-08",null,"n"]
[{"$nulls":89},"2002-01-07","2002-01-08",null,"n"]
[{"$nulls":91},"2002-01-07","2002-01-08",null,"n"]
[{"$nulls":93},"2002-01-07","2002-01-08",null,"n"]
[{"$nulls":95},"2002-01-07","2002-01-08",null,"n"]
[{"$nulls":97},"2002-01-07","2002-01-08",null,"n"]
[{"$nulls":99},"2002-01-07","2002-01-08",null,"n"]
[{"$nulls":101},"2002-01-07","2002-01-08",null,"n"]
[{"$nulls":103},"2002-01-07","2002-01-08",null,"n"]
[{"$nulls":105},"2002-01-07","2002-01-08",null,"n"]
[{"$nulls":107},"2002-01-07","2002-01-08",null,"n"]
[{"$nulls":109},"2002-01-07","2002-01-08",null,"n"]
[{"$nulls":111},"2002-01-07","2002-01-08",null,"n"]
[{"$nulls":113},"2002-01-07","2002-01-08",null,"n"]
[{"$nulls":115},"2002-01-07","2002-01-08",null,"n"]
[{"$nulls":117},"2002-01-07","2002-01-08",null,"n"]
[{"$nulls":119},"2002-01-07","2002-01-08",null,"n"]
[{"$nulls":121},"2002-01-07","2002-01-08",null,"n"]
[{"$nulls":123},"2002-01-07","2002-01-08",null,"n"]
[{"$nulls":125},"2002-01-07","2002-01-08",null,"n"]
[{"$nulls":127},"2002-01-07","2002-01-08",null,"n"]
[{"$nulls":129},"2002-01-07","2002-01-08",null,"n"]
[{"$nulls":131},"2002-01-07","2002-01-08",null,"n"]
[{"$nulls":133},"2002-01-07","2002-01-08",null,"n"]
[{"$nulls":135},"2002-01-07","2002-01-08",null,"n"]
[{"$nulls":137},"2002-01-07","2002-01-08",null,"n"]
[{"$nulls":139},"2002-01-07","2002-01-08",null,"n"]
[{"$nulls":141},"2002-01-07","2002-01-08",null,"n"]
[{"$nulls":143},"2002-01-07","2002-01-08",null,"n"]
[{"$nulls":145},"2002-01-07","2002-01-08",null,"n"]
[{"$nulls":147},"2002-01-07","2002-01-08",null,"n"]
[{"$nulls":149},"2002-01-07","2002-01-08",null,"n"]
[{"$nulls":151},"2002-01-07","2002-01-08",null,"n"]
[{"$nulls":153},"2002-01-07","2002-01-08",null,"n"]
[{"$nulls":155},"2002-01-07","2002-01-08",null,"n"]
[{"$nulls":157},"2002-01-07","2002-01-08",null,"n"]
[{"$nulls":159},"2002-01-07","2002-01-08",null,"n"]
[{"$nulls":161},"2002-01-07","2002-01-08",null,"n"]
[{"$nulls":163},"2002-01-07","2002-01-08",null,"n"]
[{"$nulls":165},"2002-01-07","2002-01-08",null,"n"]
[{"$nulls":167},"2002-01-07","2002-01-08",null,"n"]
[{"$nulls":169},"2002-01-07","2002-01-08",null,"n"]
[{"$nulls":171},"2002-01-07","2002-01-08",null,"n"]
[{"$nulls":173},"2002-01-07","2002-01-08",null,"n"]
[{"$nulls":175},"2002-01-07","2002-01-08",null,"n"]
[{"$nulls":177},"2002-01-07","2002-01-08",null,"n"]
[{"$nulls":179},"2002-01-07","2002-01-08",null,"n"]
[{"$nulls":181},"2002-01-07","2002-01-08",null,"n"]
[{"$nulls":183},"2002-01-07","2002-01-08",null,"n"]
[{"$nulls":185},"2002-01-07","2002-01-08",null,"n"]
[{"$nulls":187},"2002-01-07","2002-01-08",null,"n"]
[{"$nulls":189},"2002-01-07","2002-01-08",null,"n"]
[{"$nulls":191},"2002-01-07","2002-01-08",null,"n"]
[{"$nulls":193},"2002-01-07","2002-01-08",null,"n"]
[{"$nulls":195},"2002-01-07","2002-01-08",null,"n"]
[{"$nulls":197},"2002-01-07","2002-01-08",null,"n"]
[{"$nulls":199},"2002-01-07","2002-01-08",null,"n"]
[{"$nulls":201},"2002-01-07","2002-01-08",null,"n"]
[{"$nulls":203},"2002-01-07","2002-01-08",null,"n"]
[{"$nulls":205},"2002-01-07","2002-01-08",null,"n"]
[{"$nulls":207},"2002-01-07","2002-01-08",null,"n"]
[{"$nulls":209},"2002-01-07","2002-01-08",null,"n"]
[{"$nulls":211},"2002-01-07","2002-01-08",null,"n"]
[{"$nulls":213},"2002-01-07","2002-01-08",null,"n"]
[{"$nulls":215},"2002-01-07","2002-01-08",null,"n"]
[{"$nulls":217},"2002-01-07","2002-01-08",null,"n"]
[{"$nulls":219},"2002-01-07","2002-01-08",null,"n"]
[{"$nulls":221},"2002-01-07","2002-01-08",null,"n"]
[{"$nulls":223},"2002-01-07","2002-01-08",null,"n"]
[{"$nulls":225},"2002-01-07","2002-01-08",null,"n"]

{"sheet":"F_Bernier","index":7,"n_rows":117,"n_cols":229,"rows_kept":117}
[]
[]
[null,null,{"$f":"NOW()","v":"2019-04-05T20:01:37.330"}]
[]
[null,null,"Nom","Bernier"]
[]
[{"$nulls":4},"Congés","Maladie","Maternité","Evnt. Familial","Congé Parental","Absence non rému.","Congé Paternité","Demi-journée"]
[null,null,"Date début","Date fin","CP","Mal","Mat","Evf","Cpa","AbsNR","Cpat","Dj"]
[null,null,"2019-01-01","2019-01-01",1]
[null,null,"2019-01-02","2019-01-02",0.5]
{"$rows_empty":14}
[{"$nulls":4},{"$f":"SUM(E9:E24)","v":1.5},0,0,0,0,0,0,0]
{"$rows_empty":12}
[{"$nulls":70},"n"]
[{"$nulls":69},"2002-01-07","2002-01-08",null,"n"]
[{"$nulls":71},"2002-01-07","2002-01-08",null,"n"]
[{"$nulls":73},"2002-01-07","2002-01-08",null,"n"]
[{"$nulls":75},"2002-01-07","2002-01-08",null,"n"]
[{"$nulls":77},"2002-01-07","2002-01-08",null,"n"]
[{"$nulls":79},"2002-01-07","2002-01-08",null,"n"]
[{"$nulls":81},"2002-01-07","2002-01-08",null,"n"]
[{"$nulls":83},"2002-01-07","2002-01-08",null,"n"]
[{"$nulls":85},"2002-01-07","2002-01-08",null,"n"]
[{"$nulls":87},"2002-01-07","2002-01-08",null,"n"]
[{"$nulls":89},"2002-01-07","2002-01-08",null,"n"]
[{"$nulls":91},"2002-01-07","2002-01-08",null,"n"]
[{"$nulls":93},"2002-01-07","2002-01-08",null,"n"]
[{"$nulls":95},"2002-01-07","2002-01-08",null,"n"]
[{"$nulls":97},"2002-01-07","2002-01-08",null,"n"]
[{"$nulls":99},"2002-01-07","2002-01-08",null,"n"]
[{"$nulls":101},"2002-01-07","2002-01-08",null,"n"]
[{"$nulls":103},"2002-01-07","2002-01-08",null,"n"]
[{"$nulls":105},"2002-01-07","2002-01-08",null,"n"]
[{"$nulls":107},"2002-01-07","2002-01-08",null,"n"]
[{"$nulls":109},"2002-01-07","2002-01-08",null,"n"]
[{"$nulls":111},"2002-01-07","2002-01-08",null,"n"]
[{"$nulls":113},"2002-01-07","2002-01-08",null,"n"]
[{"$nulls":115},"2002-01-07","2002-01-08",null,"n"]
[{"$nulls":117},"2002-01-07","2002-01-08",null,"n"]
[{"$nulls":119},"2002-01-07","2002-01-08",null,"n"]
[{"$nulls":121},"2002-01-07","2002-01-08",null,"n"]
[{"$nulls":123},"2002-01-07","2002-01-08",null,"n"]
[{"$nulls":125},"2002-01-07","2002-01-08",null,"n"]
[{"$nulls":127},"2002-01-07","2002-01-08",null,"n"]
[{"$nulls":129},"2002-01-07","2002-01-08",null,"n"]
[{"$nulls":131},"2002-01-07","2002-01-08",null,"n"]
[{"$nulls":133},"2002-01-07","2002-01-08",null,"n"]
[{"$nulls":135},"2002-01-07","2002-01-08",null,"n"]
[{"$nulls":137},"2002-01-07","2002-01-08",null,"n"]
[{"$nulls":139},"2002-01-07","2002-01-08",null,"n"]
[{"$nulls":141},"2002-01-07","2002-01-08",null,"n"]
[{"$nulls":143},"2002-01-07","2002-01-08",null,"n"]
[{"$nulls":145},"2002-01-07","2002-01-08",null,"n"]
[{"$nulls":147},"2002-01-07","2002-01-08",null,"n"]
[{"$nulls":149},"2002-01-07","2002-01-08",null,"n"]
[{"$nulls":151},"2002-01-07","2002-01-08",null,"n"]
[{"$nulls":153},"2002-01-07","2002-01-08",null,"n"]
[{"$nulls":155},"2002-01-07","2002-01-08",null,"n"]
[{"$nulls":157},"2002-01-07","2002-01-08",null,"n"]
[{"$nulls":159},"2002-01-07","2002-01-08",null,"n"]
[{"$nulls":161},"2002-01-07","2002-01-08",null,"n"]
[{"$nulls":163},"2002-01-07","2002-01-08",null,"n"]
[{"$nulls":165},"2002-01-07","2002-01-08",null,"n"]
[{"$nulls":167},"2002-01-07","2002-01-08",null,"n"]
[{"$nulls":169},"2002-01-07","2002-01-08",null,"n"]
[{"$nulls":171},"2002-01-07","2002-01-08",null,"n"]
[{"$nulls":173},"2002-01-07","2002-01-08",null,"n"]
[{"$nulls":175},"2002-01-07","2002-01-08",null,"n"]
[{"$nulls":177},"2002-01-07","2002-01-08",null,"n"]
[{"$nulls":179},"2002-01-07","2002-01-08",null,"n"]
[{"$nulls":181},"2002-01-07","2002-01-08",null,"n"]
[{"$nulls":183},"2002-01-07","2002-01-08",null,"n"]
[{"$nulls":185},"2002-01-07","2002-01-08",null,"n"]
[{"$nulls":187},"2002-01-07","2002-01-08",null,"n"]
[{"$nulls":189},"2002-01-07","2002-01-08",null,"n"]
[{"$nulls":191},"2002-01-07","2002-01-08",null,"n"]
[{"$nulls":193},"2002-01-07","2002-01-08",null,"n"]
[{"$nulls":195},"2002-01-07","2002-01-08",null,"n"]
[{"$nulls":197},"2002-01-07","2002-01-08",null,"n"]
[{"$nulls":199},"2002-01-07","2002-01-08",null,"n"]
[{"$nulls":201},"2002-01-07","2002-01-08",null,"n"]
[{"$nulls":203},"2002-01-07","2002-01-08",null,"n"]
[{"$nulls":205},"2002-01-07","2002-01-08",null,"n"]
[{"$nulls":207},"2002-01-07","2002-01-08",null,"n"]
[{"$nulls":209},"2002-01-07","2002-01-08",null,"n"]
[{"$nulls":211},"2002-01-07","2002-01-08",null,"n"]
[{"$nulls":213},"2002-01-07","2002-01-08",null,"n"]
[{"$nulls":215},"2002-01-07","2002-01-08",null,"n"]
[{"$nulls":217},"2002-01-07","2002-01-08",null,"n"]
[{"$nulls":219},"2002-01-07","2002-01-08",null,"n"]
[{"$nulls":221},"2002-01-07","2002-01-08",null,"n"]
[{"$nulls":223},"2002-01-07","2002-01-08",null,"n"]
[{"$nulls":225},"2002-01-07","2002-01-08",null,"n"]

{"sheet":"F_Bisson","index":8,"n_rows":117,"n_cols":229,"rows_kept":117}
[]
[]
[null,null,{"$f":"NOW()","v":"2019-04-05T20:01:37.330"}]
[]
[null,null,"Nom","Bisson"]
[]
[{"$nulls":4},"Congés","Maladie","Maternité","Evnt. Familial","Congé Parental","Absence non rému.","Congé Paternité","Demi-journée"]
[null,null,"Date début","Date fin","CP","Mal","Mat","Evf","Cpa","AbsNR","Cpat","Dj"]
[null,null,"2019-01-01","2019-01-01",null,0.5]
[null,null,"2019-01-01","2019-01-01",null,null,0.5]
[null,null,"2019-01-07","2019-01-11",5]
{"$rows_empty":13}
[{"$nulls":4},{"$f":"SUM(E9:E24)","v":5},0.5,0.5,0,0,0,0,0]
{"$rows_empty":12}
[{"$nulls":70},"n"]
[{"$nulls":69},"2002-01-07","2002-01-08",null,"n"]
[{"$nulls":71},"2002-01-07","2002-01-08",null,"n"]
[{"$nulls":73},"2002-01-07","2002-01-08",null,"n"]
[{"$nulls":75},"2002-01-07","2002-01-08",null,"n"]
[{"$nulls":77},"2002-01-07","2002-01-08",null,"n"]
[{"$nulls":79},"2002-01-07","2002-01-08",null,"n"]
[{"$nulls":81},"2002-01-07","2002-01-08",null,"n"]
[{"$nulls":83},"2002-01-07","2002-01-08",null,"n"]
[{"$nulls":85},"2002-01-07","2002-01-08",null,"n"]
[{"$nulls":87},"2002-01-07","2002-01-08",null,"n"]
[{"$nulls":89},"2002-01-07","2002-01-08",null,"n"]
[{"$nulls":91},"2002-01-07","2002-01-08",null,"n"]
[{"$nulls":93},"2002-01-07","2002-01-08",null,"n"]
[{"$nulls":95},"2002-01-07","2002-01-08",null,"n"]
[{"$nulls":97},"2002-01-07","2002-01-08",null,"n"]
[{"$nulls":99},"2002-01-07","2002-01-08",null,"n"]
[{"$nulls":101},"2002-01-07","2002-01-08",null,"n"]
[{"$nulls":103},"2002-01-07","2002-01-08",null,"n"]
[{"$nulls":105},"2002-01-07","2002-01-08",null,"n"]
[{"$nulls":107},"2002-01-07","2002-01-08",null,"n"]
[{"$nulls":109},"2002-01-07","2002-01-08",null,"n"]
[{"$nulls":111},"2002-01-07","2002-01-08",null,"n"]
[{"$nulls":113},"2002-01-07","2002-01-08",null,"n"]
[{"$nulls":115},"2002-01-07","2002-01-08",null,"n"]
[{"$nulls":117},"2002-01-07","2002-01-08",null,"n"]
[{"$nulls":119},"2002-01-07","2002-01-08",null,"n"]
[{"$nulls":121},"2002-01-07","2002-01-08",null,"n"]
[{"$nulls":123},"2002-01-07","2002-01-08",null,"n"]
[{"$nulls":125},"2002-01-07","2002-01-08",null,"n"]
[{"$nulls":127},"2002-01-07","2002-01-08",null,"n"]
[{"$nulls":129},"2002-01-07","2002-01-08",null,"n"]
[{"$nulls":131},"2002-01-07","2002-01-08",null,"n"]
[{"$nulls":133},"2002-01-07","2002-01-08",null,"n"]
[{"$nulls":135},"2002-01-07","2002-01-08",null,"n"]
[{"$nulls":137},"2002-01-07","2002-01-08",null,"n"]
[{"$nulls":139},"2002-01-07","2002-01-08",null,"n"]
[{"$nulls":141},"2002-01-07","2002-01-08",null,"n"]
[{"$nulls":143},"2002-01-07","2002-01-08",null,"n"]
[{"$nulls":145},"2002-01-07","2002-01-08",null,"n"]
[{"$nulls":147},"2002-01-07","2002-01-08",null,"n"]
[{"$nulls":149},"2002-01-07","2002-01-08",null,"n"]
[{"$nulls":151},"2002-01-07","2002-01-08",null,"n"]
[{"$nulls":153},"2002-01-07","2002-01-08",null,"n"]
[{"$nulls":155},"2002-01-07","2002-01-08",null,"n"]
[{"$nulls":157},"2002-01-07","2002-01-08",null,"n"]
[{"$nulls":159},"2002-01-07","2002-01-08",null,"n"]
[{"$nulls":161},"2002-01-07","2002-01-08",null,"n"]
[{"$nulls":163},"2002-01-07","2002-01-08",null,"n"]
[{"$nulls":165},"2002-01-07","2002-01-08",null,"n"]
[{"$nulls":167},"2002-01-07","2002-01-08",null,"n"]
[{"$nulls":169},"2002-01-07","2002-01-08",null,"n"]
[{"$nulls":171},"2002-01-07","2002-01-08",null,"n"]
[{"$nulls":173},"2002-01-07","2002-01-08",null,"n"]
[{"$nulls":175},"2002-01-07","2002-01-08",null,"n"]
[{"$nulls":177},"2002-01-07","2002-01-08",null,"n"]
[{"$nulls":179},"2002-01-07","2002-01-08",null,"n"]
[{"$nulls":181},"2002-01-07","2002-01-08",null,"n"]
[{"$nulls":183},"2002-01-07","2002-01-08",null,"n"]
[{"$nulls":185},"2002-01-07","2002-01-08",null,"n"]
[{"$nulls":187},"2002-01-07","2002-01-08",null,"n"]
[{"$nulls":189},"2002-01-07","2002-01-08",null,"n"]
[{"$nulls":191},"2002-01-07","2002-01-08",null,"n"]
[{"$nulls":193},"2002-01-07","2002-01-08",null,"n"]
[{"$nulls":195},"2002-01-07","2002-01-08",null,"n"]
[{"$nulls":197},"2002-01-07","2002-01-08",null,"n"]
[{"$nulls":199},"2002-01-07","2002-01-08",null,"n"]
[{"$nulls":201},"2002-01-07","2002-01-08",null,"n"]
[{"$nulls":203},"2002-01-07","2002-01-08",null,"n"]
[{"$nulls":205},"2002-01-07","2002-01-08",null,"n"]
[{"$nulls":207},"2002-01-07","2002-01-08",null,"n"]
[{"$nulls":209},"2002-01-07","2002-01-08",null,"n"]
[{"$nulls":211},"2002-01-07","2002-01-08",null,"n"]
[{"$nulls":213},"2002-01-07","2002-01-08",null,"n"]
[{"$nulls":215},"2002-01-07","2002-01-08",null,"n"]
[{"$nulls":217},"2002-01-07","2002-01-08",null,"n"]
[{"$nulls":219},"2002-01-07","2002-01-08",null,"n"]
[{"$nulls":221},"2002-01-07","2002-01-08",null,"n"]
[{"$nulls":223},"2002-01-07","2002-01-08",null,"n"]
[{"$nulls":225},"2002-01-07","2002-01-08",null,"n"]

{"sheet":"F_Dupond","index":9,"n_rows":117,"n_cols":229,"rows_kept":117}
[]
[]
[null,null,{"$f":"NOW()","v":"2019-04-05T20:01:37.330"}]
[]
[null,null,"Nom","Dupond"]
[]
[{"$nulls":4},"Congés","Maladie","Maternité","Evnt. Familial","Congé Parental","Absence non rému.","Congé Paternité","Demi-journée"]
[null,null,"Date début","Date fin","CP","Mal","Mat","Evf","Cpa","AbsNR","Cpat","Dj"]
[null,null,"2019-01-01","2019-01-01",0.5]
[null,null,"2019-01-02","2019-01-02",null,null,0.5]
[null,null,"2019-01-07","2019-01-11",{"$nulls":3},5]
{"$rows_empty":13}
[{"$nulls":4},{"$f":"SUM(E9:E24)","v":0.5},0,0.5,5,0,0,0,0]
{"$rows_empty":12}
[{"$nulls":70},"n"]
[{"$nulls":69},"2002-01-07","2002-01-08",null,"n"]
[{"$nulls":71},"2002-01-07","2002-01-08",null,"n"]
[{"$nulls":73},"2002-01-07","2002-01-08",null,"n"]
[{"$nulls":75},"2002-01-07","2002-01-08",null,"n"]
[{"$nulls":77},"2002-01-07","2002-01-08",null,"n"]
[{"$nulls":79},"2002-01-07","2002-01-08",null,"n"]
[{"$nulls":81},"2002-01-07","2002-01-08",null,"n"]
[{"$nulls":83},"2002-01-07","2002-01-08",null,"n"]
[{"$nulls":85},"2002-01-07","2002-01-08",null,"n"]
[{"$nulls":87},"2002-01-07","2002-01-08",null,"n"]
[{"$nulls":89},"2002-01-07","2002-01-08",null,"n"]
[{"$nulls":91},"2002-01-07","2002-01-08",null,"n"]
[{"$nulls":93},"2002-01-07","2002-01-08",null,"n"]
[{"$nulls":95},"2002-01-07","2002-01-08",null,"n"]
[{"$nulls":97},"2002-01-07","2002-01-08",null,"n"]
[{"$nulls":99},"2002-01-07","2002-01-08",null,"n"]
[{"$nulls":101},"2002-01-07","2002-01-08",null,"n"]
[{"$nulls":103},"2002-01-07","2002-01-08",null,"n"]
[{"$nulls":105},"2002-01-07","2002-01-08",null,"n"]
[{"$nulls":107},"2002-01-07","2002-01-08",null,"n"]
[{"$nulls":109},"2002-01-07","2002-01-08",null,"n"]
[{"$nulls":111},"2002-01-07","2002-01-08",null,"n"]
[{"$nulls":113},"2002-01-07","2002-01-08",null,"n"]
[{"$nulls":115},"2002-01-07","2002-01-08",null,"n"]
[{"$nulls":117},"2002-01-07","2002-01-08",null,"n"]
[{"$nulls":119},"2002-01-07","2002-01-08",null,"n"]
[{"$nulls":121},"2002-01-07","2002-01-08",null,"n"]
[{"$nulls":123},"2002-01-07","2002-01-08",null,"n"]
[{"$nulls":125},"2002-01-07","2002-01-08",null,"n"]
[{"$nulls":127},"2002-01-07","2002-01-08",null,"n"]
[{"$nulls":129},"2002-01-07","2002-01-08",null,"n"]
[{"$nulls":131},"2002-01-07","2002-01-08",null,"n"]
[{"$nulls":133},"2002-01-07","2002-01-08",null,"n"]
[{"$nulls":135},"2002-01-07","2002-01-08",null,"n"]
[{"$nulls":137},"2002-01-07","2002-01-08",null,"n"]
[{"$nulls":139},"2002-01-07","2002-01-08",null,"n"]
[{"$nulls":141},"2002-01-07","2002-01-08",null,"n"]
[{"$nulls":143},"2002-01-07","2002-01-08",null,"n"]
[{"$nulls":145},"2002-01-07","2002-01-08",null,"n"]
[{"$nulls":147},"2002-01-07","2002-01-08",null,"n"]
[{"$nulls":149},"2002-01-07","2002-01-08",null,"n"]
[{"$nulls":151},"2002-01-07","2002-01-08",null,"n"]
[{"$nulls":153},"2002-01-07","2002-01-08",null,"n"]
[{"$nulls":155},"2002-01-07","2002-01-08",null,"n"]
[{"$nulls":157},"2002-01-07","2002-01-08",null,"n"]
[{"$nulls":159},"2002-01-07","2002-01-08",null,"n"]
[{"$nulls":161},"2002-01-07","2002-01-08",null,"n"]
[{"$nulls":163},"2002-01-07","2002-01-08",null,"n"]
[{"$nulls":165},"2002-01-07","2002-01-08",null,"n"]
[{"$nulls":167},"2002-01-07","2002-01-08",null,"n"]
[{"$nulls":169},"2002-01-07","2002-01-08",null,"n"]
[{"$nulls":171},"2002-01-07","2002-01-08",null,"n"]
[{"$nulls":173},"2002-01-07","2002-01-08",null,"n"]
[{"$nulls":175},"2002-01-07","2002-01-08",null,"n"]
[{"$nulls":177},"2002-01-07","2002-01-08",null,"n"]
[{"$nulls":179},"2002-01-07","2002-01-08",null,"n"]
[{"$nulls":181},"2002-01-07","2002-01-08",null,"n"]
[{"$nulls":183},"2002-01-07","2002-01-08",null,"n"]
[{"$nulls":185},"2002-01-07","2002-01-08",null,"n"]
[{"$nulls":187},"2002-01-07","2002-01-08",null,"n"]
[{"$nulls":189},"2002-01-07","2002-01-08",null,"n"]
[{"$nulls":191},"2002-01-07","2002-01-08",null,"n"]
[{"$nulls":193},"2002-01-07","2002-01-08",null,"n"]
[{"$nulls":195},"2002-01-07","2002-01-08",null,"n"]
[{"$nulls":197},"2002-01-07","2002-01-08",null,"n"]
[{"$nulls":199},"2002-01-07","2002-01-08",null,"n"]
[{"$nulls":201},"2002-01-07","2002-01-08",null,"n"]
[{"$nulls":203},"2002-01-07","2002-01-08",null,"n"]
[{"$nulls":205},"2002-01-07","2002-01-08",null,"n"]
[{"$nulls":207},"2002-01-07","2002-01-08",null,"n"]
[{"$nulls":209},"2002-01-07","2002-01-08",null,"n"]
[{"$nulls":211},"2002-01-07","2002-01-08",null,"n"]
[{"$nulls":213},"2002-01-07","2002-01-08",null,"n"]
[{"$nulls":215},"2002-01-07","2002-01-08",null,"n"]
[{"$nulls":217},"2002-01-07","2002-01-08",null,"n"]
[{"$nulls":219},"2002-01-07","2002-01-08",null,"n"]
[{"$nulls":221},"2002-01-07","2002-01-08",null,"n"]
[{"$nulls":223},"2002-01-07","2002-01-08",null,"n"]
[{"$nulls":225},"2002-01-07","2002-01-08",null,"n"]