{"text_format":"3","workbook":"xlsx","n_sheets":8,"sheets":["Plan","BD","Fériés","ParamètresCouleurs","Couleurs","modèle","F_Balu","F_Dupond"],"not_rendered":{"macros":1,"defined_names":7},"read":"whole","date_system":"1900"}

{"sheet":"Plan","index":0,"n_rows":23,"n_cols":378,"rows_kept":23}
[null,{"$f":"DATE(Année,1,1)","v":"2018-01-01"},{"$f":"IF(MONTH(B3)<>MONTH(C3),TEXT(C3,\"mmmm aa\"),\"\")","v":""},"","","","","","","","","","","","","","","","","","","","","","","","","","","","","","février 18","","","","","","","","","","","","","","","","","","","","","","","","","","","","mars 18","","","","","",{"$f":"IF(MONTH(BN3)<>MONTH(BO3),TEXT(BO3,\"mmmm aa\"),\"\")","v":""},"","","","","","","","","","","","","","","","","","","","","","","","","avril 18","","","","","","","","","","","","","","","","","","","","","","","","","","","","","","mai 18","","","","","","","","",{"$f":"IF(MONTH(DZ3)<>MONTH(EA3),TEXT(EA3,\"mmmm aa\"),\"\")","v":""},"","","","","","","","","","","","","","","","","","","","","","juin 18","","","","","","","","","","","","","","","","","","","","","","","","","","","","","",{"$f":"IF(MONTH(FZ3)<>MONTH(GA3),TEXT(GA3,\"mmmm aa\"),\"\")","v":"juillet 18"},{"$f":"IF(MONTH(GA3)<>MONTH(GB3),TEXT(GB3,\"mmmm aa\"),\"\")","v":""},{"$f":"IF(MONTH(GB3)<>MONTH(GC3),TEXT(GC3,\"mmmm aa\"),\"\")","v":""},{"$f":"IF(MONTH(GC3)<>MONTH(GD3),TEXT(GD3,\"mmmm aa\"),\"\")","v":""},{"$f":"IF(MONTH(GD3)<>MONTH(GE3),TEXT(GE3,\"mmmm aa\"),\"\")","v":""},{"$f":"IF(MONTH(GE3)<>MONTH(GF3),TEXT(GF3,\"mmmm aa\"),\"\")","v":""},{"$f":"IF(MONTH(GF3)<>MONTH(GG3),TEXT(GG3,\"mmmm aa\"),\"\")","v":""},{"$f":"IF(MONTH(GG3)<>MONTH(GH3),TEXT(GH3,\"mmmm aa\"),\"\")","v":""},{"$f":"IF(MONTH(GH3)<>MONTH(GI3),TEXT(GI3,\"mmmm aa\"),\"\")","v":""},{"$f":"IF(MONTH(GI3)<>MONTH(GJ3),TEXT(GJ3,\"mmmm aa\"),\"\")","v":""},{"$f":"IF(MONTH(GJ3)<>MONTH(GK3),TEXT(GK3,\"mmmm aa\"),\"\")","v":""},{"$f":"IF(MONTH(GK3)<>MONTH(GL3),TEXT(GL3,\"mmmm aa\"),\"\")","v":""},{"$f":"IF(MONTH(GL3)<>MONTH(GM3),TEXT(GM3,\"mmmm aa\"),\"\")","v":""},{"$f":"IF(MONTH(GM3)<>MONTH(GN3),TEXT(GN3,\"mmmm aa\"),\"\")","v":""},{"$f":"IF(MONTH(GN3)<>MONTH(GO3),TEXT(GO3,\"mmmm aa\"),\"\")","v":""},{"$f":"IF(MONTH(GO3)<>MONTH(GP3),TEXT(GP3,\"mmmm aa\"),\"\")","v":""},{"$f":"IF(MONTH(GP3)<>MONTH(GQ3),TEXT(GQ3,\"mmmm aa\"),\"\")","v":""},{"$f":"IF(MONTH(GQ3)<>MONTH(GR3),TEXT(GR3,\"mmmm aa\"),\"\")","v":""},{"$f":"IF(MONTH(GR3)<>MONTH(GS3),TEXT(GS3,\"mmmm aa\"),\"\")","v":""},{"$f":"IF(MONTH(GS3)<>MONTH(GT3),TEXT(GT3,\"mmmm aa\"),\"\")","v":""},{"$f":"IF(MONTH(GT3)<>MONTH(GU3),TEXT(GU3,\"mmmm aa\"),\"\")","v":""},{"$f":"IF(MONTH(GU3)<>MONTH(GV3),TEXT(GV3,\"mmmm aa\"),\"\")","v":""},{"$f":"IF(MONTH(GV3)<>MONTH(GW3),TEXT(GW3,\"mmmm aa\"),\"\")","v":""},{"$f":"IF(MONTH(GW3)<>MONTH(GX3),TEXT(GX3,\"mmmm aa\"),\"\")","v":""},{"$f":"IF(MONTH(GX3)<>MONTH(GY3),TEXT(GY3,\"mmmm aa\"),\"\")","v":""},{"$f":"IF(MONTH(GY3)<>MONTH(GZ3),TEXT(GZ3,\"mmmm aa\"),\"\")","v":""},{"$f":"IF(MONTH(GZ3)<>MONTH(HA3),TEXT(HA3,\"mmmm aa\"),\"\")","v":""},{"$f":"IF(MONTH(HA3)<>MONTH(HB3),TEXT(HB3,\"mmmm aa\"),\"\")","v":""},{"$f":"IF(MONTH(HB3)<>MONTH(HC3),TEXT(HC3,\"mmmm aa\"),\"\")","v":""},{"$f":"IF(MONTH(HC3)<>MONTH(HD3),TEXT(HD3,\"mmmm aa\"),\"\")","v":""},{"$f":"IF(MONTH(HD3)<>MONTH(HE3),TEXT(HE3,\"mmmm aa\"),\"\")","v":""},{"$f":"IF(MONTH(HE3)<>MONTH(HF3),TEXT(HF3,\"mmmm aa\"),\"\")","v":"août 18"},{"$f":"IF(MONTH(HF3)<>MONTH(HG3),TEXT(HG3,\"mmmm aa\"),\"\")","v":""},{"$f":"IF(MONTH(HG3)<>MONTH(HH3),TEXT(HH3,\"mmmm aa\"),\"\")","v":""},{"$f":"IF(MONTH(HH3)<>MONTH(HI3),TEXT(HI3,\"mmmm aa\"),\"\")","v":""},{"$f":"IF(MONTH(HI3)<>MONTH(HJ3),TEXT(HJ3,\"mmmm aa\"),\"\")","v":""},{"$f":"IF(MONTH(HJ3)<>MONTH(HK3),TEXT(HK3,\"mmmm aa\"),\"\")","v":""},{"$f":"IF(MONTH(HK3)<>MONTH(HL3),TEXT(HL3,\"mmmm aa\"),\"\")","v":""},{"$f":"IF(MONTH(HL3)<>MONTH(HM3),TEXT(HM3,\"mmmm aa\"),\"\")","v":""},{"$f":"IF(MONTH(HM3)<>MONTH(HN3),TEXT(HN3,\"mmmm aa\"),\"\")","v":""},{"$f":"IF(MONTH(HN3)<>MONTH(HO3),TEXT(HO3,\"mmmm aa\"),\"\")","v":""},{"$f":"IF(MONTH(HO3)<>MONTH(HP3),TEXT(HP3,\"mmmm aa\"),\"\")","v":""},{"$f":"IF(MONTH(HP3)<>MONTH(HQ3),TEXT(HQ3,\"mmmm aa\"),\"\")","v":""},{"$f":"IF(MONTH(HQ3)<>MONTH(HR3),TEXT(HR3,\"mmmm aa\"),\"\")","v":""},{"$f":"IF(MONTH(HR3)<>MONTH(HS3),TEXT(HS3,\"mmmm aa\"),\"\")","v":""},{"$f":"IF(MONTH(HS3)<>MONTH(HT3),TEXT(HT3,\"mmmm aa\"),\"\")","v":""},{"$f":"IF(MONTH(HT3)<>MONTH(HU3),TEXT(HU3,\"mmmm aa\"),\"\")","v":""},{"$f":"IF(MONTH(HU3)<>MONTH(HV3),TEXT(HV3,\"mmmm aa\"),\"\")","v":""},{"$f":"IF(MONTH(HV3)<>MONTH(HW3),TEXT(HW3,\"mmmm aa\"),\"\")","v":""},{"$f":"IF(MONTH(HW3)<>MONTH(HX3),TEXT(HX3,\"mmmm aa\"),\"\")","v":""},{"$f":"IF(MONTH(HX3)<>MONTH(HY3),TEXT(HY3,\"mmmm aa\"),\"\")","v":""},{"$f":"IF(MONTH(HY3)<>MONTH(HZ3),TEXT(HZ3,\"mmmm aa\"),\"\")","v":""},{"$f":"IF(MONTH(HZ3)<>MONTH(IA3),TEXT(IA3,\"mmmm aa\"),\"\")","v":""},{"$f":"IF(MONTH(IA3)<>MONTH(IB3),TEXT(IB3,\"mmmm aa\"),\"\")","v":""},{"$f":"IF(MONTH(IB3)<>MONTH(IC3),TEXT(IC3,\"mmmm aa\"),\"\")","v":""},{"$f":"IF(MONTH(IC3)<>MONTH(ID3),TEXT(ID3,\"mmmm aa\"),\"\")","v":""},{"$f":"IF(MONTH(ID3)<>MONTH(IE3),TEXT(IE3,\"mmmm aa\"),\"\")","v":""},{"$f":"IF(MONTH(IE3)<>MONTH(IF3),TEXT(IF3,\"mmmm aa\"),\"\")","v":""},{"$f":"IF(MONTH(IF3)<>MONTH(IG3),TEXT(IG3,\"mmmm aa\"),\"\")","v":""},{"$f":"IF(MONTH(IG3)<>MONTH(IH3),TEXT(IH3,\"mmmm aa\"),\"\")","v":""},{"$f":"IF(MONTH(IH3)<>MONTH(II3),TEXT(II3,\"mmmm aa\"),\"\")","v":""},{"$f":"IF(MONTH(II3)<>MONTH(IJ3),TEXT(IJ3,\"mmmm aa\"),\"\")","v":""},{"$f":"IF(MONTH(IJ3)<>MONTH(IK3),TEXT(IK3,\"mmmm aa\"),\"\")","v":"septembre 18"},{"$f":"IF(MONTH(IK3)<>MONTH(IL3),TEXT(IL3,\"mmmm aa\"),\"\")","v":""},{"$f":"IF(MONTH(IL3)<>MONTH(IM3),TEXT(IM3,\"mmmm aa\"),\"\")","v":""},{"$f":"IF(MONTH(IM3)<>MONTH(IN3),TEXT(IN3,\"mmmm aa\"),\"\")","v":""},{"$f":"IF(MONTH(IN3)<>MONTH(IO3),TEXT(IO3,\"mmmm aa\"),\"\")","v":""},{"$f":"IF(MONTH(IO3)<>MONTH(IP3),TEXT(IP3,\"mmmm aa\"),\"\")","v":""},{"$f":"IF(MONTH(IP3)<>MONTH(IQ3),TEXT(IQ3,\"mmmm aa\"),\"\")","v":""},{"$f":"IF(MONTH(IQ3)<>MONTH(IR3),TEXT(IR3,\"mmmm aa\"),\"\")","v":""},{"$f":"IF(MONTH(IR3)<>MONTH(IS3),TEXT(IS3,\"mmmm aa\"),\"\")","v":""},{"$f":"IF(MONTH(IS3)<>MONTH(IT3),TEXT(IT3,\"mmmm aa\"),\"\")","v":""},{"$f":"IF(MONTH(IT3)<>MONTH(IU3),TEXT(IU3,\"mmmm aa\"),\"\")","v":""},{"$f":"IF(MONTH(IU3)<>MONTH(IV3),TEXT(IV3,\"mmmm aa\"),\"\")","v":""},{"$f":"IF(MONTH(IV3)<>MONTH(IW3),TEXT(IW3,\"mmmm aa\"),\"\")","v":""},{"$f":"IF(MONTH(IW3)<>MONTH(IX3),TEXT(IX3,\"mmmm aa\"),\"\")","v":""},{"$f":"IF(MONTH(IX3)<>MONTH(IY3),TEXT(IY3,\"mmmm aa\"),\"\")","v":""},{"$f":"IF(MONTH(IY3)<>MONTH(IZ3),TEXT(IZ3,\"mmmm aa\"),\"\")","v":""},{"$f":"IF(MONTH(IZ3)<>MONTH(JA3),TEXT(JA3,\"mmmm aa\"),\"\")","v":""},{"$f":"IF(MONTH(JA3)<>MONTH(JB3),TEXT(JB3,\"mmmm aa\"),\"\")","v":""},{"$f":"IF(MONTH(JB3)<>MONTH(JC3),TEXT(JC3,\"mmmm aa\"),\"\")","v":""},{"$f":"IF(MONTH(JC3)<>MONTH(JD3),TEXT(JD3,\"mmmm aa\"),\"\")","v":""},{"$f":"IF(MONTH(JD3)<>MONTH(JE3),TEXT(JE3,\"mmmm aa\"),\"\")","v":""},{"$f":"IF(MONTH(JE3)<>MONTH(JF3),TEXT(JF3,\"mmmm aa\"),\"\")","v":""},{"$f":"IF(MONTH(JF3)<>MONTH(JG3),TEXT(JG3,\"mmmm aa\"),\"\")","v":""},{"$f":"IF(MONTH(JG3)<>MONTH(JH3),TEXT(JH3,\"mmmm aa\"),\"\")","v":""},{"$f":"IF(MONTH(JH3)<>MONTH(JI3),TEXT(JI3,\"mmmm aa\"),\"\")","v":""},{"$f":"IF(MONTH(JI3)<>MONTH(JJ3),TEXT(JJ3,\"mmmm aa\"),\"\")","v":""},{"$f":"IF(MONTH(JJ3)<>MONTH(JK3),TEXT(JK3,\"mmmm aa\"),\"\")","v":""},{"$f":"IF(MONTH(JK3)<>MONTH(JL3),TEXT(JL3,\"mmmm aa\"),\"\")","v":""},{"$f":"IF(MONTH(JL3)<>MONTH(JM3),TEXT(JM3,\"mmmm aa\"),\"\")","v":""},{"$f":"IF(MONTH(JM3)<>MONTH(JN3),TEXT(JN3,\"mmmm aa\"),\"\")","v":""},{"$f":"IF(MONTH(JN3)<>MONTH(JO3),TEXT(JO3,\"mmmm aa\"),\"\")","v":"octobre 18"},{"$f":"IF(MONTH(JO3)<>MONTH(JP3),TEXT(JP3,\"mmmm aa\"),\"\")","v":""},{"$f":"IF(MONTH(JP3)<>MONTH(JQ3),TEXT(JQ3,\"mmmm aa\"),\"\")","v":""},{"$f":"IF(MONTH(JQ3)<>MONTH(JR3),TEXT(JR3,\"mmmm aa\"),\"\")","v":""},{"$f":"IF(MONTH(JR3)<>MONTH(JS3),TEXT(JS3,\"mmmm aa\"),\"\")","v":""},{"$f":"IF(MONTH(JS3)<>MONTH(JT3),TEXT(JT3,\"mmmm aa\"),\"\")","v":""},{"$f":"IF(MONTH(JT3)<>MONTH(JU3),TEXT(JU3,\"mmmm aa\"),\"\")","v":""},{"$f":"IF(MONTH(JU3)<>MONTH(JV3),TEXT(JV3,\"mmmm aa\"),\"\")","v":""},{"$f":"IF(MONTH(JV3)<>MONTH(JW3),TEXT(JW3,\"mmmm aa\"),\"\")","v":""},{"$f":"IF(MONTH(JW3)<>MONTH(JX3),TEXT(JX3,\"mmmm aa\"),\"\")","v":""},{"$f":"IF(MONTH(JX3)<>MONTH(JY3),TEXT(JY3,\"mmmm aa\"),\"\")","v":""},{"$f":"IF(MONTH(JY3)<>MONTH(JZ3),TEXT(JZ3,\"mmmm aa\"),\"\")","v":""},{"$f":"IF(MONTH(JZ3)<>MONTH(KA3),TEXT(KA3,\"mmmm aa\"),\"\")","v":""},{"$f":"IF(MONTH(KA3)<>MONTH(KB3),TEXT(KB3,\"mmmm aa\"),\"\")","v":""},{"$f":"IF(MONTH(KB3)<>MONTH(KC3),TEXT(KC3,\"mmmm aa\"),\"\")","v":""},{"$f":"IF(MONTH(KC3)<>MONTH(KD3),TEXT(KD3,\"mmmm aa\"),\"\")","v":""},{"$f":"IF(MONTH(KD3)<>MONTH(KE3),TEXT(KE3,\"mmmm aa\"),\"\")","v":""},{"$f":"IF(MONTH(KE3)<>MONTH(KF3),TEXT(KF3,\"mmmm aa\"),\"\")","v":""},{"$f":"IF(MONTH(KF3)<>MONTH(KG3),TEXT(KG3,\"mmmm aa\"),\"\")","v":""},{"$f":"IF(MONTH(KG3)<>MONTH(KH3),TEXT(KH3,\"mmmm aa\"),\"\")","v":""},{"$f":"IF(MONTH(KH3)<>MONTH(KI3),TEXT(KI3,\"mmmm aa\"),\"\")","v":""},{"$f":"IF(MONTH(KI3)<>MONTH(KJ3),TEXT(KJ3,\"mmmm aa\"),\"\")","v":""},{"$f":"IF(MONTH(KJ3)<>MONTH(KK3),TEXT(KK3,\"mmmm aa\"),\"\")","v":""},{"$f":"IF(MONTH(KK3)<>MONTH(KL3),TEXT(KL3,\"mmmm aa\"),\"\")","v":""},{"$f":"IF(MONTH(KL3)<>MONTH(KM3),TEXT(KM3,\"mmmm aa\"),\"\")","v":""},{"$f":"IF(MONTH(KM3)<>MONTH(KN3),TEXT(KN3,\"mmmm aa\"),\"\")","v":""},{"$f":"IF(MONTH(KN3)<>MONTH(KO3),TEXT(KO3,\"mmmm aa\"),\"\")","v":""},{"$f":"IF(MONTH(KO3)<>MONTH(KP3),TEXT(KP3,\"mmmm aa\"),\"\")","v":""},{"$f":"IF(MONTH(KP3)<>MONTH(KQ3),TEXT(KQ3,\"mmmm aa\"),\"\")","v":""},{"$f":"IF(MONTH(KQ3)<>MONTH(KR3),TEXT(KR3,\"mmmm aa\"),\"\")","v":""},{"$f":"IF(MONTH(KR3)<>MONTH(KS3),TEXT(KS3,\"mmmm aa\"),\"\")","v":""},{"$f":"IF(MONTH(KS3)<>MONTH(KT3),TEXT(KT3,\"mmmm aa\"),\"\")","v":"novembre 18"},{"$f":"IF(MONTH(KT3)<>MONTH(KU3),TEXT(KU3,\"mmmm aa\"),\"\")","v":""},{"$f":"IF(MONTH(KU3)<>MONTH(KV3),TEXT(KV3,\"mmmm aa\"),\"\")","v":""},{"$f":"IF(MONTH(KV3)<>MONTH(KW3),TEXT(KW3,\"mmmm aa\"),\"\")","v":""},{"$f":"IF(MONTH(KW3)<>MONTH(KX3),TEXT(KX3,\"mmmm aa\"),\"\")","v":""},{"$f":"IF(MONTH(KX3)<>MONTH(KY3),TEXT(KY3,\"mmmm aa\"),\"\")","v":""},{"$f":"IF(MONTH(KY3)<>MONTH(KZ3),TEXT(KZ3,\"mmmm aa\"),\"\")","v":""},{"$f":"IF(MONTH(KZ3)<>MONTH(LA3),TEXT(LA3,\"mmmm aa\"),\"\")","v":""},{"$f":"IF(MONTH(LA3)<>MONTH(LB3),TEXT(LB3,\"mmmm aa\"),\"\")","v":""},{"$f":"IF(MONTH(LB3)<>MONTH(LC3),TEXT(LC3,\"mmmm aa\"),\"\")","v":""},{"$f":"IF(MONTH(LC3)<>MONTH(LD3),TEXT(LD3,\"mmmm aa\"),\"\")","v":""},{"$f":"IF(MONTH(LD3)<>MONTH(LE3),TEXT(LE3,\"mmmm aa\"),\"\")","v":""},{"$f":"IF(MONTH(LE3)<>MONTH(LF3),TEXT(LF3,\"mmmm aa\"),\"\")","v":""},{"$f":"IF(MONTH(LF3)<>MONTH(LG3),TEXT(LG3,\"mmmm aa\"),\"\")","v":""},{"$f":"IF(MONTH(LG3)<>MONTH(LH3),TEXT(LH3,\"mmmm aa\"),\"\")","v":""},{"$f":"IF(MONTH(LH3)<>MONTH(LI3),TEXT(LI3,\"mmmm aa\"),\"\")","v":""},{"$f":"IF(MONTH(LI3)<>MONTH(LJ3),TEXT(LJ3,\"mmmm aa\"),\"\")","v":""},{"$f":"IF(MONTH(LJ3)<>MONTH(LK3),TEXT(LK3,\"mmmm aa\"),\"\")","v":""},{"$f":"IF(MONTH(LK3)<>MONTH(LL3),TEXT(LL3,\"mmmm aa\"),\"\")","v":""},{"$f":"IF(MONTH(LL3)<>MONTH(LM3),TEXT(LM3,\"mmmm aa\"),\"\")","v":""},{"$f":"IF(MONTH(LM3)<>MONTH(LN3),TEXT(LN3,\"mmmm aa\"),\"\")","v":""},{"$f":"IF(MONTH(LN3)<>MONTH(LO3),TEXT(LO3,\"mmmm aa\"),\"\")","v":""},{"$f":"IF(MONTH(LO3)<>MONTH(LP3),TEXT(LP3,\"mmmm aa\"),\"\")","v":""},{"$f":"IF(MONTH(LP3)<>MONTH(LQ3),TEXT(LQ3,\"mmmm aa\"),\"\")","v":""},{"$f":"IF(MONTH(LQ3)<>MONTH(LR3),TEXT(LR3,\"mmmm aa\"),\"\")","v":""},{"$f":"IF(MONTH(LR3)<>MONTH(LS3),TEXT(LS3,\"mmmm aa\"),\"\")","v":""},{"$f":"IF(MONTH(LS3)<>MONTH(LT3),TEXT(LT3,\"mmmm aa\"),\"\")","v":""},{"$f":"IF(MONTH(LT3)<>MONTH(LU3),TEXT(LU3,\"mmmm aa\"),\"\")","v":""},{"$f":"IF(MONTH(LU3)<>MONTH(LV3),TEXT(LV3,\"mmmm aa\"),\"\")","v":""},{"$f":"IF(MONTH(LV3)<>MONTH(LW3),TEXT(LW3,\"mmmm aa\"),\"\")","v":""},{"$f":"IF(MONTH(LW3)<>MONTH(LX3),TEXT(LX3,\"mmmm aa\"),\"\")","v":"décembre 18"},{"$f":"IF(MONTH(LX3)<>MONTH(LY3),TEXT(LY3,\"mmmm aa\"),\"\")","v":""},{"$f":"IF(MONTH(LY3)<>MONTH(LZ3),TEXT(LZ3,\"mmmm aa\"),\"\")","v":""},{"$f":"IF(MONTH(LZ3)<>MONTH(MA3),TEXT(MA3,\"mmmm aa\"),\"\")","v":""},{"$f":"IF(MONTH(MA3)<>MONTH(MB3),TEXT(MB3,\"mmmm aa\"),\"\")","v":""},{"$f":"IF(MONTH(MB3)<>MONTH(MC3),TEXT(MC3,\"mmmm aa\"),\"\")","v":""},{"$f":"IF(MONTH(MC3)<>MONTH(MD3),TEXT(MD3,\"mmmm aa\"),\"\")","v":""},{"$f":"IF(MONTH(MD3)<>MONTH(ME3),TEXT(ME3,\"mmmm aa\"),\"\")","v":""},{"$f":"IF(MONTH(ME3)<>MONTH(MF3),TEXT(MF3,\"mmmm aa\"),\"\")","v":""},{"$f":"IF(MONTH(MF3)<>MONTH(MG3),TEXT(MG3,\"mmmm aa\"),\"\")","v":""},{"$f":"IF(MONTH(MG3)<>MONTH(MH3),TEXT(MH3,\"mmmm aa\"),\"\")","v":""},{"$f":"IF(MONTH(MH3)<>MONTH(MI3),TEXT(MI3,\"mmmm aa\"),\"\")","v":""},{"$f":"IF(MONTH(MI3)<>MONTH(MJ3),TEXT(MJ3,\"mmmm aa\"),\"\")","v":""},{"$f":"IF(MONTH(MJ3)<>MONTH(MK3),TEXT(MK3,\"mmmm aa\"),\"\")","v":""},{"$f":"IF(MONTH(MK3)<>MONTH(ML3),TEXT(ML3,\"mmmm aa\"),\"\")","v":""},{"$f":"IF(MONTH(ML3)<>MONTH(MM3),TEXT(MM3,\"mmmm aa\"),\"\")","v":""},{"$f":"IF(MONTH(MM3)<>MONTH(MN3),TEXT(MN3,\"mmmm aa\"),\"\")","v":""},{"$f":"IF(MONTH(MN3)<>MONTH(MO3),TEXT(MO3,\"mmmm aa\"),\"\")","v":""},{"$f":"IF(MONTH(MO3)<>MONTH(MP3),TEXT(MP3,\"mmmm aa\"),\"\")","v":""},{"$f":"IF(MONTH(MP3)<>MONTH(MQ3),TEXT(MQ3,\"mmmm aa\"),\"\")","v":""},{"$f":"IF(MONTH(MQ3)<>MONTH(MR3),TEXT(MR3,\"mmmm aa\"),\"\")","v":""},{"$f":"IF(MONTH(MR3)<>MONTH(MS3),TEXT(MS3,\"mmmm aa\"),\"\")","v":""},{"$f":"IF(MONTH(MS3)<>MONTH(MT3),TEXT(MT3,\"mmmm aa\"),\"\")","v":""},{"$f":"IF(MONTH(MT3)<>MONTH(MU3),TEXT(MU3,\"mmmm aa\"),\"\")","v":""},{"$f":"IF(MONTH(MU3)<>MONTH(MV3),TEXT(MV3,\"mmmm aa\"),\"\")","v":""},{"$f":"IF(MONTH(MV3)<>MONTH(MW3),TEXT(MW3,\"mmmm aa\"),\"\")","v":""},{"$f":"IF(MONTH(MW3)<>MONTH(MX3),TEXT(MX3,\"mmmm aa\"),\"\")","v":""},{"$f":"IF(MONTH(MX3)<>MONTH(MY3),TEXT(MY3,\"mmmm aa\"),\"\")","v":""},{"$f":"IF(MONTH(MY3)<>MONTH(MZ3),TEXT(MZ3,\"mmmm aa\"),\"\")","v":""},{"$f":"IF(MONTH(MZ3)<>MONTH(NA3),TEXT(NA3,\"mmmm aa\"),\"\")","v":""},{"$f":"IF(MONTH(NA3)<>MONTH(NB3),TEXT(NB3,\"mmmm aa\"),\"\")","v":""},{"$f":"IF(MONTH(NB3)<>MONTH(NC3),TEXT(NC3,\"mmmm aa\"),\"\")","v":"janvier 19"},{"$f":"IF(MONTH(NC3)<>MONTH(ND3),TEXT(ND3,\"mmmm aa\"),\"\")","v":""},{"$f":"IF(MONTH(ND3)<>MONTH(NE3),TEXT(NE3,\"mmmm aa\"),\"\")","v":""},{"$f":"IF(MONTH(NE3)<>MONTH(NF3),TEXT(NF3,\"mmmm aa\"),\"\")","v":""},{"$f":"IF(MONTH(NF3)<>MONTH(NG3),TEXT(NG3,\"mmmm aa\"),\"\")","v":""},{"$f":"IF(MONTH(NG3)<>MONTH(NH3),TEXT(NH3,\"mmmm aa\"),\"\")","v":""},{"$f":"IF(MONTH(NH3)<>MONTH(NI3),TEXT(NI3,\"mmmm aa\"),\"\")","v":""},{"$f":"IF(MONTH(NI3)<>MONTH(NJ3),TEXT(NJ3,\"mmmm aa\"),\"\")","v":""},{"$f":"IF(MONTH(NJ3)<>MONTH(NK3),TEXT(NK3,\"mmmm aa\"),\"\")","v":""},{"$f":"IF(MONTH(NK3)<>MONTH(NL3),TEXT(NL3,\"mmmm aa\"),\"\")","v":""},{"$f":"IF(MONTH(NL3)<>MONTH(NM3),TEXT(NM3,\"mmmm aa\"),\"\")","v":""},{"$f":"IF(MONTH(NM3)<>MONTH(NN3),TEXT(NN3,\"mmmm aa\"),\"\")","v":""}]
[null,{"$f":"DATE(Année,1,1)","v":"2018-01-01"},{"$f":"B2+1","v":"2018-01-02"},{"$f":"C2+1","v":"2018-01-03"},"2018-01-04","2018-01-05","2018-01-06","2018-01-07","2018-01-08","2018-01-09","2018-01-10","2018-01-11","2018-01-12","2018-01-13","2018-01-14","2018-01-15","2018-01-16","2018-01-17","2018-01-18","2018-01-19","2018-01-20","2018-01-21","2018-01-22","2018-01-23","2018-01-24","2018-01-25","2018-01-26","2018-01-27","2018-01-28","2018-01-29","2018-01-30","2018-01-31","2018-02-01","2018-02-02","2018-02-03","2018-02-04","2018-02-05","2018-02-06","2018-02-07","2018-02-08","2018-02-09","2018-02-10","2018-02-11","2018-02-12","2018-02-13","2018-02-14","2018-02-15","2018-02-16","2018-02-17","2018-02-18","2018-02-19","2018-02-20","2018-02-21","2018-02-22","2018-02-23","2018-02-24","2018-02-25","2018-02-26","2018-02-27","2018-02-28","2018-03-01","2018-03-02","2018-03-03","2018-03-04","2018-03-05","2018-03-06","2018-03-07",{"$f":"BO2+1","v":"2018-03-08"},"2018-03-09","2018-03-10","2018-03-11","2018-03-12","2018-03-13","2018-03-14","2018-03-15","2018-03-16","2018-03-17","2018-03-18","2018-03-19","2018-03-20","2018-03-21","2018-03-22","2018-03-23","2018-03-24","2018-03-25","2018-03-26","2018-03-27","2018-03-28","2018-03-29","2018-03-30","2018-03-31","2018-04-01","2018-04-02","2018-04-03","2018-04-04","2018-04-05","2018-04-06","2018-04-07","2018-04-08","2018-04-09","2018-04-10","2018-04-11","2018-04-12","2018-04-13","2018-04-14","2018-04-15","2018-04-16","2018-04-17","2018-04-18","2018-04-19","2018-04-20","2018-04-21","2018-04-22","2018-04-23","2018-04-24","2018-04-25","2018-04-26","2018-04-27","2018-04-28","2018-04-29","2018-04-30","2018-05-01","2018-05-02","2018-05-03","2018-05-04","2018-05-05","2018-05-06","2018-05-07","2018-05-08","2018-05-09","2018-05-10",{"$f":"EA2+1","v":"2018-05-11"},"2018-05-12","2018-05-13","2018-05-14","2018-05-15","2018-05-16","2018-05-17","2018-05-18","2018-05-19","2018-05-20","2018-05-21","2018-05-22","2018-05-23","2018-05-24","2018-05-25","2018-05-26","2018-05-27","2018-05-28","2018-05-29","2018-05-30","2018-05-31","2018-06-01","2018-06-02","2018-06-03","2018-06-04","2018-06-05","2018-06-06","2018-06-07","2018-06-08","2018-06-09","2018-06-10","2018-06-11","2018-06-12","2018-06-13","2018-06-14","2018-06-15","2018-06-16","2018-06-17","2018-06-18","2018-06-19","2018-06-20","2018-06-21","2018-06-22","2018-06-23","2018-06-24","2018-06-25","2018-06-26","2018-06-27","2018-06-28","2018-06-29","2018-06-30",{"$f":"FZ2+1","v":"2018-07-01"},{"$f":"GA2+1","v":"2018-07-02"},{"$f":"GB2+1","v":"2018-07-03"},{"$f":"GC2+1","v":"2018-07-04"},{"$f":"GD2+1","v":"2018-07-05"},{"$f":"GE2+1","v":"2018-07-06"},{"$f":"GF2+1","v":"2018-07-07"},{"$f":"GG2+1","v":"2018-07-08"},{"$f":"GH2+1","v":"2018-07-09"},{"$f":"GI2+1","v":"2018-07-10"},{"$f":"GJ2+1","v":"2018-07-11"},{"$f":"GK2+1","v":"2018-07-12"},{"$f":"GL2+1","v":"2018-07-13"},{"$f":"GM2+1","v":"2018-07-14"},{"$f":"GN2+1","v":"2018-07-15"},{"$f":"GO2+1","v":"2018-07-16"},{"$f":"GP2+1","v":"2018-07-17"},{"$f":"GQ2+1","v":"2018-07-18"},{"$f":"GR2+1","v":"2018-07-19"},{"$f":"GS2+1","v":"2018-07-20"},{"$f":"GT2+1","v":"2018-07-21"},{"$f":"GU2+1","v":"2018-07-22"},{"$f":"GV2+1","v":"2018-07-23"},{"$f":"GW2+1","v":"2018-07-24"},{"$f":"GX2+1","v":"2018-07-25"},{"$f":"GY2+1","v":"2018-07-26"},{"$f":"GZ2+1","v":"2018-07-27"},{"$f":"HA2+1","v":"2018-07-28"},{"$f":"HB2+1","v":"2018-07-29"},{"$f":"HC2+1","v":"2018-07-30"},{"$f":"HD2+1","v":"2018-07-31"},{"$f":"HE2+1","v":"2018-08-01"},{"$f":"HF2+1","v":"2018-08-02"},{"$f":"HG2+1","v":"2018-08-03"},{"$f":"HH2+1","v":"2018-08-04"},{"$f":"HI2+1","v":"2018-08-05"},{"$f":"HJ2+1","v":"2018-08-06"},{"$f":"HK2+1","v":"2018-08-07"},{"$f":"HL2+1","v":"2018-08-08"},{"$f":"HM2+1","v":"2018-08-09"},{"$f":"HN2+1","v":"2018-08-10"},{"$f":"HO2+1","v":"2018-08-11"},{"$f":"HP2+1","v":"2018-08-12"},{"$f":"HQ2+1","v":"2018-08-13"},{"$f":"HR2+1","v":"2018-08-14"},{"$f":"HS2+1","v":"2018-08-15"},{"$f":"HT2+1","v":"2018-08-16"},{"$f":"HU2+1","v":"2018-08-17"},{"$f":"HV2+1","v":"2018-08-18"},{"$f":"HW2+1","v":"2018-08-19"},{"$f":"HX2+1","v":"2018-08-20"},{"$f":"HY2+1","v":"2018-08-21"},{"$f":"HZ2+1","v":"2018-08-22"},{"$f":"IA2+1","v":"2018-08-23"},{"$f":"IB2+1","v":"2018-08-24"},{"$f":"IC2+1","v":"2018-08-25"},{"$f":"ID2+1","v":"2018-08-26"},{"$f":"IE2+1","v":"2018-08-27"},{"$f":"IF2+1","v":"2018-08-28"},{"$f":"IG2+1","v":"2018-08-29"},{"$f":"IH2+1","v":"2018-08-30"},{"$f":"II2+1","v":"2018-08-31"},{"$f":"IJ2+1","v":"2018-09-01"},{"$f":"IK2+1","v":"2018-09-02"},{"$f":"IL2+1","v":"2018-09-03"},{"$f":"IM2+1","v":"2018-09-04"},{"$f":"IN2+1","v":"2018-09-05"},{"$f":"IO2+1","v":"2018-09-06"},{"$f":"IP2+1","v":"2018-09-07"},{"$f":"IQ2+1","v":"2018-09-08"},{"$f":"IR2+1","v":"2018-09-09"},{"$f":"IS2+1","v":"2018-09-10"},{"$f":"IT2+1","v":"2018-09-11"},{"$f":"IU2+1","v":"2018-09-12"},{"$f":"IV2+1","v":"2018-09-13"},{"$f":"IW2+1","v":"2018-09-14"},{"$f":"IX2+1","v":"2018-09-15"},{"$f":"IY2+1","v":"2018-09-16"},{"$f":"IZ2+1","v":"2018-09-17"},{"$f":"JA2+1","v":"2018-09-18"},{"$f":"JB2+1","v":"2018-09-19"},{"$f":"JC2+1","v":"2018-09-20"},{"$f":"JD2+1","v":"2018-09-21"},{"$f":"JE2+1","v":"2018-09-22"},{"$f":"JF2+1","v":"2018-09-23"},{"$f":"JG2+1","v":"2018-09-24"},{"$f":"JH2+1","v":"2018-09-25"},{"$f":"JI2+1","v":"2018-09-26"},{"$f":"JJ2+1","v":"2018-09-27"},{"$f":"JK2+1","v":"2018-09-28"},{"$f":"JL2+1","v":"2018-09-29"},{"$f":"JM2+1","v":"2018-09-30"},{"$f":"JN2+1","v":"2018-10-01"},{"$f":"JO2+1","v":"2018-10-02"},{"$f":"JP2+1","v":"2018-10-03"},{"$f":"JQ2+1","v":"2018-10-04"},{"$f":"JR2+1","v":"2018-10-05"},{"$f":"JS2+1","v":"2018-10-06"},{"$f":"JT2+1","v":"2018-10-07"},{"$f":"JU2+1","v":"2018-10-08"},{"$f":"JV2+1","v":"2018-10-09"},{"$f":"JW2+1","v":"2018-10-10"},{"$f":"JX2+1","v":"2018-10-11"},{"$f":"JY2+1","v":"2018-10-12"},{"$f":"JZ2+1","v":"2018-10-13"},{"$f":"KA2+1","v":"2018-10-14"},{"$f":"KB2+1","v":"2018-10-15"},{"$f":"KC2+1","v":"2018-10-16"},{"$f":"KD2+1","v":"2018-10-17"},{"$f":"KE2+1","v":"2018-10-18"},{"$f":"KF2+1","v":"2018-10-19"},{"$f":"KG2+1","v":"2018-10-20"},{"$f":"KH2+1","v":"2018-10-21"},{"$f":"KI2+1","v":"2018-10-22"},{"$f":"KJ2+1","v":"2018-10-23"},{"$f":"KK2+1","v":"2018-10-24"},{"$f":"KL2+1","v":"2018-10-25"},{"$f":"KM2+1","v":"2018-10-26"},{"$f":"KN2+1","v":"2018-10-27"},{"$f":"KO2+1","v":"2018-10-28"},{"$f":"KP2+1","v":"2018-10-29"},{"$f":"KQ2+1","v":"2018-10-30"},{"$f":"KR2+1","v":"2018-10-31"},{"$f":"KS2+1","v":"2018-11-01"},{"$f":"KT2+1","v":"2018-11-02"},{"$f":"KU2+1","v":"2018-11-03"},{"$f":"KV2+1","v":"2018-11-04"},{"$f":"KW2+1","v":"2018-11-05"},{"$f":"KX2+1","v":"2018-11-06"},{"$f":"KY2+1","v":"2018-11-07"},{"$f":"KZ2+1","v":"2018-11-08"},{"$f":"LA2+1","v":"2018-11-09"},{"$f":"LB2+1","v":"2018-11-10"},{"$f":"LC2+1","v":"2018-11-11"},{"$f":"LD2+1","v":"2018-11-12"},{"$f":"LE2+1","v":"2018-11-13"},{"$f":"LF2+1","v":"2018-11-14"},{"$f":"LG2+1","v":"2018-11-15"},{"$f":"LH2+1","v":"2018-11-16"},{"$f":"LI2+1","v":"2018-11-17"},{"$f":"LJ2+1","v":"2018-11-18"},{"$f":"LK2+1","v":"2018-11-19"},{"$f":"LL2+1","v":"2018-11-20"},{"$f":"LM2+1","v":"2018-11-21"},{"$f":"LN2+1","v":"2018-11-22"},{"$f":"LO2+1","v":"2018-11-23"},{"$f":"LP2+1","v":"2018-11-24"},{"$f":"LQ2+1","v":"2018-11-25"},{"$f":"LR2+1","v":"2018-11-26"},{"$f":"LS2+1","v":"2018-11-27"},{"$f":"LT2+1","v":"2018-11-28"},{"$f":"LU2+1","v":"2018-11-29"},{"$f":"LV2+1","v":"2018-11-30"},{"$f":"LW2+1","v":"2018-12-01"},{"$f":"LX2+1","v":"2018-12-02"},{"$f":"LY2+1","v":"2018-12-03"},{"$f":"LZ2+1","v":"2018-12-04"},{"$f":"MA2+1","v":"2018-12-05"},{"$f":"MB2+1","v":"2018-12-06"},{"$f":"MC2+1","v":"2018-12-07"},{"$f":"MD2+1","v":"2018-12-08"},{"$f":"ME2+1","v":"2018-12-09"},{"$f":"MF2+1","v":"2018-12-10"},{"$f":"MG2+1","v":"2018-12-11"},{"$f":"MH2+1","v":"2018-12-12"},{"$f":"MI2+1","v":"2018-12-13"},{"$f":"MJ2+1","v":"2018-12-14"},{"$f":"MK2+1","v":"2018-12-15"},{"$f":"ML2+1","v":"2018-12-16"},{"$f":"MM2+1","v":"2018-12-17"},{"$f":"MN2+1","v":"2018-12-18"},{"$f":"MO2+1","v":"2018-12-19"},{"$f":"MP2+1","v":"2018-12-20"},{"$f":"MQ2+1","v":"2018-12-21"},{"$f":"MR2+1","v":"2018-12-22"},{"$f":"MS2+1","v":"2018-12-23"},{"$f":"MT2+1","v":"2018-12-24"},{"$f":"MU2+1","v":"2018-12-25"},{"$f":"MV2+1","v":"2018-12-26"},{"$f":"MW2+1","v":"2018-12-27"},{"$f":"MX2+1","v":"2018-12-28"},{"$f":"MY2+1","v":"2018-12-29"},{"$f":"MZ2+1","v":"2018-12-30"},{"$f":"NA2+1","v":"2018-12-31"},{"$f":"NB2+1","v":"2019-01-01"},{"$f":"NC2+1","v":"2019-01-02"},{"$f":"ND2+1","v":"2019-01-03"},{"$f":"NE2+1","v":"2019-01-04"},{"$f":"NF2+1","v":"2019-01-05"},{"$f":"NG2+1","v":"2019-01-06"},{"$f":"NH2+1","v":"2019-01-07"},{"$f":"NI2+1","v":"2019-01-08"},{"$f":"NJ2+1","v":"2019-01-09"},{"$f":"NK2+1","v":"2019-01-10"},{"$f":"NL2+1","v":"2019-01-11"},{"$f":"NM2+1","v":"2019-01-12"}]
[null,{"$f":"DATE(Année,1,1)","v":"2018-01-01"},{"$f":"B3+1","v":"2018-01-02"},{"$f":"C3+1","v":"2018-01-03"},"2018-01-04","2018-01-05","2018-01-06","2018-01-07","2018-01-08","2018-01-09","2018-01-10","2018-01-11","2018-01-12","2018-01-13","2018-01-14","2018-01-15","2018-01-16","2018-01-17","2018-01-18","2018-01-19","2018-01-20","2018-01-21","2018-01-22","2018-01-23","2018-01-24","2018-01-25","2018-01-26","2018-01-27","2018-01-28","2018-01-29","2018-01-30","2018-01-31","2018-02-01","2018-02-02","2018-02-03","2018-02-04","2018-02-05","2018-02-06","2018-02-07","2018-02-08","2018-02-09","2018-02-10","2018-02-11","2018-02-12","2018-02-13","2018-02-14","2018-02-15","2018-02-16","2018-02-17","2018-02-18","2018-02-19","2018-02-20","2018-02-21","2018-02-22","2018-02-23","2018-02-24","2018-02-25","2018-02-26","2018-02-27","2018-02-28","2018-03-01","2018-03-02","2018-03-03","2018-03-04","2018-03-05","2018-03-06","2018-03-07",{"$f":"BO3+1","v":"2018-03-08"},"2018-03-09","2018-03-10","2018-03-11","2018-03-12","2018-03-13","2018-03-14","2018-03-15","2018-03-16","2018-03-17","2018-03-18","2018-03-19","2018-03-20","2018-03-21","2018-03-22","2018-03-23","2018-03-24","2018-03-25","2018-03-26","2018-03-27","2018-03-28","2018-03-29","2018-03-30","2018-03-31","2018-04-01","2018-04-02","2018-04-03","2018-04-04","2018-04-05","2018-04-06","2018-04-07","2018-04-08","2018-04-09","2018-04-10","2018-04-11","2018-04-12","2018-04-13","2018-04-14","2018-04-15","2018-04-16","2018-04-17","2018-04-18","2018-04-19","2018-04-20","2018-04-21","2018-04-22","2018-04-23","2018-04-24","2018-04-25","2018-04-26","2018-04-27","2018-04-28","2018-04-29","2018-04-30","2018-05-01","2018-05-02","2018-05-03","2018-05-04","2018-05-05","2018-05-06","2018-05-07","2018-05-08","2018-05-09","2018-05-10",{"$f":"EA3+1","v":"2018-05-11"},"2018-05-12","2018-05-13","2018-05-14","2018-05-15","2018-05-16","2018-05-17","2018-05-18","2018-05-19","2018-05-20","2018-05-21","2018-05-22","2018-05-23","2018-05-24","2018-05-25","2018-05-26","2018-05-27","2018-05-28","2018-05-29","2018-05-30","2018-05-31","2018-06-01","2018-06-02","2018-06-03","2018-06-04","2018-06-05","2018-06-06","2018-06-07","2018-06-08","2018-06-09","2018-06-10","2018-06-11","2018-06-12","2018-06-13","2018-06-14","2018-06-15","2018-06-16","2018-06-17","2018-06-18","2018-06-19","2018-06-20","2018-06-21","2018-06-22","2018-06-23","2018-06-24","2018-06-25","2018-06-26","2018-06-27","2018-06-28","2018-06-29","2018-06-30","2018-07-01","2018-07-02","2018-07-03","2018-07-04","2018-07-05","2018-07-06","2018-07-07","2018-07-08","2018-07-09","2018-07-10","2018-07-11","2018-07-12","2018-07-13","2018-07-14","2018-07-15","2018-07-16","2018-07-17","2018-07-18","2018-07-19","2018-07-20","2018-07-21","2018-07-22","2018-07-23","2018-07-24","2018-07-25","2018-07-26","2018-07-27","2018-07-28","2018-07-29","2018-07-30","2018-07-31","2018-08-01","2018-08-02","2018-08-03","2018-08-04","2018-08-05","2018-08-06","2018-08-07","2018-08-08","2018-08-09","2018-08-10","2018-08-11","2018-08-12","2018-08-13","2018-08-14","2018-08-15","2018-08-16","2018-08-17","2018-08-18","2018-08-19","2018-08-20","2018-08-21","2018-08-22","2018-08-23","2018-08-24","2018-08-25","2018-08-26","2018-08-27","2018-08-28","2018-08-29","2018-08-30","2018-08-31","2018-09-01","2018-09-02","2018-09-03","2018-09-04","2018-09-05","2018-09-06","2018-09-07","2018-09-08","2018-09-09","2018-09-10","2018-09-11","2018-09-12","2018-09-13","2018-09-14","2018-09-15","2018-09-16","2018-09-17","2018-09-18","2018-09-19","2018-09-20","2018-09-21","2018-09-22","2018-09-23","2018-09-24","2018-09-25","2018-09-26","2018-09-27","2018-09-28","2018-09-29","2018-09-30","2018-10-01","2018-10-02","2018-10-03","2018-10-04","2018-10-05","2018-10-06","2018-10-07","2018-10-08","2018-10-09","2018-10-10","2018-10-11","2018-10-12","2018-10-13","2018-10-14","2018-10-15","2018-10-16","2018-10-17","2018-10-18","2018-10-19","2018-10-20","2018-10-21","2018-10-22","2018-10-23","2018-10-24","2018-10-25","2018-10-26","2018-10-27","2018-10-28","2018-10-29","2018-10-30","2018-10-31","2018-11-01","2018-11-02","2018-11-03","2018-11-04","2018-11-05","2018-11-06","2018-11-07","2018-11-08","2018-11-09","2018-11-10","2018-11-11","2018-11-12","2018-11-13","2018-11-14","2018-11-15","2018-11-16","2018-11-17","2018-11-18","2018-11-19","2018-11-20","2018-11-21","2018-11-22","2018-11-23","2018-11-24","2018-11-25","2018-11-26","2018-11-27","2018-11-28","2018-11-29","2018-11-30","2018-12-01","2018-12-02","2018-12-03","2018-12-04","2018-12-05","2018-12-06","2018-12-07","2018-12-08","2018-12-09","2018-12-10","2018-12-11","2018-12-12","2018-12-13","2018-12-14","2018-12-15","2018-12-16","2018-12-17","2018-12-18","2018-12-19","2018-12-20","2018-12-21","2018-12-22","2018-12-23","2018-12-24","2018-12-25","2018-12-26","2018-12-27","2018-12-28","2018-12-29","2018-12-30","2018-12-31","2019-01-01","2019-01-02","2019-01-03","2019-01-04","2019-01-05","2019-01-06","2019-01-07","2019-01-08","2019-01-09","2019-01-10","2019-01-11","2019-01-12"]
["Balu","CP","CP","CP","CP","CP",{"$nulls":9},"CP","CP","CP",{"$nulls":5},"Dj","Dj","Dj"]
["Dupond",null,"Mal","Mal","Mal",{"$nulls":4},"AbsNR","AbsNR","AbsNR"]
["Bernier"]
["Bisson"]
["Dupont"]
["Durand"]
["Durandal"]
["Magdalou"]
["Magnier"]
["Martin"]
["Martinet"]
["Mazoni"]
["Mercier"]
["Miroux"]
["Nicolas"]
["Tantucci"]
["."]
["."]
["."]
["."]

{"sheet":"BD","index":1,"n_rows":6,"n_cols":5,"rows_kept":6}
["Nom","Début","Fin","TypeCongés","nb jours"]
["Balu","2018-01-01","2018-01-05","CP",5]
["Balu","2018-01-15","2018-01-17","CP",3]
["Balu","2018-01-23","2018-01-25","Dj",3]
["Dupond","2018-01-02","2018-01-04","Mal",3]
["Dupond","2018-01-09","2018-01-11","AbsNR",3]

{"sheet":"Fériés","index":2,"n_rows":12,"n_cols":5,"rows_kept":12}
["Année",null,"Fériés",null,"Pâques"]
[2018,null,{"$f":"DATE(A2,1,1)","v":"2018-01-01"},null,{"$f":"ROUND(DATE(Année,4,MOD(234-11*MOD(Année,19),30))/7,0)*7-6","v":"2018-04-01"}]
[null,null,{"$f":"DATE(A2,5,1)","v":"2018-05-01"}]
[null,null,{"$f":"DATE(A2,5,8)","v":"2018-05-08"}]
[null,null,{"$f":"DATE(A2,7,14)","v":"2018-07-14"}]
[null,null,{"$f":"DATE(A2,8,15)","v":"2018-08-15"}]
[null,null,{"$f":"DATE(A2,11,1)","v":"2018-11-01"}]
[null,null,{"$f":"DATE(A2,11,11)","v":"2018-11-11"}]
[null,null,{"$f":"DATE(A2,12,25)","v":"2018-12-25"}]
[null,null,{"$f":"E2+1","v":"2018-04-02"}]
[null,null,{"$f":"E2+39","v":"2018-05-10"}]
[null,null,{"$f":"E2+50","v":"2018-05-21"}]

{"sheet":"ParamètresCouleurs","index":3,"n_rows":12,"n_cols":23,"rows_kept":12}
[{"$nulls":17},"Accueil"]
[]
[]
["Couleurs"]
["CP","Mal","Mat","Evf","Cpa","AbsNR","Cpat","Dj"]
["Congés","Maladie","Maternité","Evnt. Familial","Congé Parental","Absence non rému.","Congé Paternité","Demi-journée",{"$nulls":13},"Noms de champ"]
[{"$nulls":21},"Année","=Fériés!$A$2"]
[{"$nulls":21},"Congés","=ParamètresCouleurs!$A$5:$Q$5"]
[{"$nulls":21},"CongésSem","=Plan!$B$4:$NN$23"]
[{"$nulls":21},"fériés","=Fériés!$C$2:$C$12"]
[{"$nulls":21},"MesCouleurs","=ParamètresCouleurs!$A$5:$Q$5"]
[{"$nulls":21},"MotifsCongés","=ParamètresCouleurs!$A$6:$Q$6"]

{"sheet":"Couleurs","index":4,"n_rows":2,"n_cols":9,"rows_kept":2}
[]
[{"$nulls":8},"Généré automatiquement à partir de paramètresCouleurs"]

{"sheet":"modèle","index":5,"n_rows":117,"n_cols":229,"rows_kept":117}
[]
[]
[null,null,{"$f":"NOW()","v":"2018-01-16T06:35:52.920"}]
[]
[null,null,"Nom"]
[]
[{"$nulls":4},{"$f":"MotifsCongés","v":"Congés"},"Maladie","Maternité","Evnt. Familial","Congé Parental","Absence non rému.","Congé Paternité","Demi-journée"]
[null,null,"Date début","Date fin",{"$f":"Congés","v":"CP"},"Mal","Mat","Evf","Cpa","AbsNR","Cpat","Dj"]
{"$rows_empty":16}
[{"$nulls":4},{"$f":"SUM(E9:E24)","v":0},0,0,0,0,0,0,0]
{"$rows_empty":12}
[{"$nulls":70},"n"]
[{"$nulls":69},"2002-01-07","2002-01-08",null,"n"]
[{"$nulls":71},"2002-01-07","2002-01-08",null,"n"]
[{"$nulls":73},"2002-01-07","2002-01-08",null,"n"]
[{"$nulls":75},"2002-01-07","2002-01-08",null,"n"]
[{"$nulls":77},"2002-01-07","2002-01-08",null,"n"]
[{"$nulls":79},"2002-01-07","2002-01-08",null,"n"]
[{"$nulls":81},"2002-01-07","2002-01-08",null,"n"]
[{"$nulls":83},"2002-01-07","2002-01-08",null,"n"]
[{"$nulls":85},"2002-01-07","2002-01-08",null,"n"]
[{"$nulls":87},"2002-01-07","2002-01-08",null,"n"]
[{"$nulls":89},"2002-01-07","2002-01-08",null,"n"]
[{"$nulls":91},"2002-01-07","2002-01-08",null,"n"]
[{"$nulls":93},"2002-01-07","2002-01-08",null,"n"]
[{"$nulls":95},"2002-01-07","2002-01-08",null,"n"]
[{"$nulls":97},"2002-01-07","2002-01-08",null,"n"]
[{"$nulls":99},"2002-01-07","2002-01-08",null,"n"]
[{"$nulls":101},"2002-01-07","2002-01-08",null,"n"]
[{"$nulls":103},"2002-01-07","2002-01-08",null,"n"]
[{"$nulls":105},"2002-01-07","2002-01-08",null,"n"]
[{"$nulls":107},"2002-01-07","2002-01-08",null,"n"]
[{"$nulls":109},"2002-01-07","2002-01-08",null,"n"]
[{"$nulls":111},"2002-01-07","2002-01-08",null,"n"]
[{"$nulls":113},"2002-01-07","2002-01-08",null,"n"]
[{"$nulls":115},"2002-01-07","2002-01-08",null,"n"]
[{"$nulls":117},"2002-01-07","2002-01-08",null,"n"]
[{"$nulls":119},"2002-01-07","2002-01-08",null,"n"]
[{"$nulls":121},"2002-01-07","2002-01-08",null,"n"]
[{"$nulls":123},"2002-01-07","2002-01-08",null,"n"]
[{"$nulls":125},"2002-01-07","2002-01-08",null,"n"]
[{"$nulls":127},"2002-01-07","2002-01-08",null,"n"]
[{"$nulls":129},"2002-01-07","2002-01-08",null,"n"]
[{"$nulls":131},"2002-01-07","2002-01-08",null,"n"]
[{"$nulls":133},"2002-01-07","2002-01-08",null,"n"]
[{"$nulls":135},"2002-01-07","2002-01-08",null,"n"]
[{"$nulls":137},"2002-01-07","2002-01-08",null,"n"]
[{"$nulls":139},"2002-01-07","2002-01-08",null,"n"]
[{"$nulls":141},"2002-01-07","2002-01-08",null,"n"]
[{"$nulls":143},"2002-01-07","2002-01-08",null,"n"]
[{"$nulls":145},"2002-01-07","2002-01-08",null,"n"]
[{"$nulls":147},"2002-01-07","2002-01-08",null,"n"]
[{"$nulls":149},"2002-01-07","2002-01-08",null,"n"]
[{"$nulls":151},"2002-01-07","2002-01-08",null,"n"]
[{"$nulls":153},"2002-01-07","2002-01-08",null,"n"]
[{"$nulls":155},"2002-01-07","2002-01-08",null,"n"]
[{"$nulls":157},"2002-01-07","2002-01-08",null,"n"]
[{"$nulls":159},"2002-01-07","2002-01-08",null,"n"]
[{"$nulls":161},"2002-01-07","2002-01-08",null,"n"]
[{"$nulls":163},"2002-01-07","2002-01-08",null,"n"]
[{"$nulls":165},"2002-01-07","2002-01-08",null,"n"]
[{"$nulls":167},"2002-01-07","2002-01-08",null,"n"]
[{"$nulls":169},"2002-01-07","2002-01-08",null,"n"]
[{"$nulls":171},"2002-01-07","2002-01-08",null,"n"]
[{"$nulls":173},"2002-01-07","2002-01-08",null,"n"]
[{"$nulls":175},"2002-01-07","2002-01-08",null,"n"]
[{"$nulls":177},"2002-01-07","2002-01-08",null,"n"]
[{"$nulls":179},"2002-01-07","2002-01-08",null,"n"]
[{"$nulls":181},"2002-01-07","2002-01-08",null,"n"]
[{"$nulls":183},"2002-01-07","2002-01-08",null,"n"]
[{"$nulls":185},"2002-01-07","2002-01-08",null,"n"]
[{"$nulls":187},"2002-01-07","2002-01-08",null,"n"]
[{"$nulls":189},"2002-01-07","2002-01-08",null,"n"]
[{"$nulls":191},"2002-01-07","2002-01-08",null,"n"]
[{"$nulls":193},"2002-01-07","2002-01-08",null,"n"]
[{"$nulls":195},"2002-01-07","2002-01-08",null,"n"]
[{"$nulls":197},"2002-01-07","2002-01-08",null,"n"]
[{"$nulls":199},"2002-01-07","2002-01-08",null,"n"]
[{"$nulls":201},"2002-01-07","2002-01-08",null,"n"]
[{"$nulls":203},"2002-01-07","2002-01-08",null,"n"]
[{"$nulls":205},"2002-01-07","2002-01-08",null,"n"]
[{"$nulls":207},"2002-01-07","2002-01-08",null,"n"]
[{"$nulls":209},"2002-01-07","2002-01-08",null,"n"]
[{"$nulls":211},"2002-01-07","2002-01-08",null,"n"]
[{"$nulls":213},"2002-01-07","2002-01-08",null,"n"]
[{"$nulls":215},"2002-01-07","2002-01-08",null,"n"]
[{"$nulls":217},"2002-01-07","2002-01-08",null,"n"]
[{"$nulls":219},"2002-01-07","2002-01-08",null,"n"]
[{"$nulls":221},"2002-01-07","2002-01-08",null,"n"]
[{"$nulls":223},"2002-01-07","2002-01-08",null,"n"]
[{"$nulls":225},"2002-01-07","2002-01-08",null,"n"]

{"sheet":"F_Balu","index":6,"n_rows":117,"n_cols":229,"rows_kept":117}
[]
[]
[null,null,{"$f":"NOW()","v":"2018-01-16T06:35:52.920"}]
[]
[null,null,"Nom","Balu"]
[]
[{"$nulls":4},"Congés","Maladie","Maternité","Evnt. Familial","Congé Parental","Absence non rému.","Congé Paternité","Demi-journée"]
[null,null,"Date début","Date fin","CP","Mal","Mat","Evf","Cpa","AbsNR","Cpat","Dj"]
[null,null,"2018-01-01","2018-01-05",5]
[null,null,"2018-01-15","2018-01-17",3]
[null,null,"2018-01-23","2018-01-25",{"$nulls":7},3]
{"$rows_empty":13}
[{"$nulls":4},{"$f":"SUM(E9:E24)","v":8},0,0,0,0,0,0,3]
{"$rows_empty":12}
[{"$nulls":70},"n"]
[{"$nulls":69},"2002-01-07","2002-01-08",null,"n"]
[{"$nulls":71},"2002-01-07","2002-01-08",null,"n"]
[{"$nulls":73},"2002-01-07","2002-01-08",null,"n"]
[{"$nulls":75},"2002-01-07","2002-01-08",null,"n"]
[{"$nulls":77},"2002-01-07","2002-01-08",null,"n"]
[{"$nulls":79},"2002-01-07","2002-01-08",null,"n"]
[{"$nulls":81},"2002-01-07","2002-01-08",null,"n"]
[{"$nulls":83},"2002-01-07","2002-01-08",null,"n"]
[{"$nulls":85},"2002-01-07","2002-01-08",null,"n"]
[{"$nulls":87},"2002-01-07","2002-01-08",null,"n"]
[{"$nulls":89},"2002-01-07","2002-01-08",null,"n"]
[{"$nulls":91},"2002-01-07","2002-01-08",null,"n"]
[{"$nulls":93},"2002-01-07","2002-01-08",null,"n"]
[{"$nulls":95},"2002-01-07","2002-01-08",null,"n"]
[{"$nulls":97},"2002-01-07","2002-01-08",null,"n"]
[{"$nulls":99},"2002-01-07","2002-01-08",null,"n"]
[{"$nulls":101},"2002-01-07","2002-01-08",null,"n"]
[{"$nulls":103},"2002-01-07","2002-01-08",null,"n"]
[{"$nulls":105},"2002-01-07","2002-01-08",null,"n"]
[{"$nulls":107},"2002-01-07","2002-01-08",null,"n"]
[{"$nulls":109},"2002-01-07","2002-01-08",null,"n"]
[{"$nulls":111},"2002-01-07","2002-01-08",null,"n"]
[{"$nulls":113},"2002-01-07","2002-01-08",null,"n"]
[{"$nulls":115},"2002-01-07","2002-01-08",null,"n"]
[{"$nulls":117},"2002-01-07","2002-01-08",null,"n"]
[{"$nulls":119},"2002-01-07","2002-01-08",null,"n"]
[{"$nulls":121},"2002-01-07","2002-01-08",null,"n"]
[{"$nulls":123},"2002-01-07","2002-01-08",null,"n"]
[{"$nulls":125},"2002-01-07","2002-01-08",null,"n"]
[{"$nulls":127},"2002-01-07","2002-01-08",null,"n"]
[{"$nulls":129},"2002-01-07","2002-01-08",null,"n"]
[{"$nulls":131},"2002-01-07","2002-01-08",null,"n"]
[{"$nulls":133},"2002-01-07","2002-01-08",null,"n"]
[{"$nulls":135},"2002-01-07","2002-01-08",null,"n"]
[{"$nulls":137},"2002-01-07","2002-01-08",null,"n"]
[{"$nulls":139},"2002-01-07","2002-01-08",null,"n"]
[{"$nulls":141},"2002-01-07","2002-01-08",null,"n"]
[{"$nulls":143},"2002-01-07","2002-01-08",null,"n"]
[{"$nulls":145},"2002-01-07","2002-01-08",null,"n"]
[{"$nulls":147},"2002-01-07","2002-01-08",null,"n"]
[{"$nulls":149},"2002-01-07","2002-01-08",null,"n"]
[{"$nulls":151},"2002-01-07","2002-01-08",null,"n"]
[{"$nulls":153},"2002-01-07","2002-01-08",null,"n"]
[{"$nulls":155},"2002-01-07","2002-01-08",null,"n"]
[{"$nulls":157},"2002-01-07","2002-01-08",null,"n"]
[{"$nulls":159},"2002-01-07","2002-01-08",null,"n"]
[{"$nulls":161},"2002-01-07","2002-01-08",null,"n"]
[{"$nulls":163},"2002-01-07","2002-01-08",null,"n"]
[{"$nulls":165},"2002-01-07","2002-01-08",null,"n"]
[{"$nulls":167},"2002-01-07","2002-01-08",null,"n"]
[{"$nulls":169},"2002-01-07","2002-01-08",null,"n"]
[{"$nulls":171},"2002-01-07","2002-01-08",null,"n"]
[{"$nulls":173},"2002-01-07","2002-01-08",null,"n"]
[{"$nulls":175},"2002-01-07","2002-01-08",null,"n"]
[{"$nulls":177},"2002-01-07","2002-01-08",null,"n"]
[{"$nulls":179},"2002-01-07","2002-01-08",null,"n"]
[{"$nulls":181},"2002-01-07","2002-01-08",null,"n"]
[{"$nulls":183},"2002-01-07","2002-01-08",null,"n"]
[{"$nulls":185},"2002-01-07","2002-01-08",null,"n"]
[{"$nulls":187},"2002-01-07","2002-01-08",null,"n"]
[{"$nulls":189},"2002-01-07","2002-01-08",null,"n"]
[{"$nulls":191},"2002-01-07","2002-01-08",null,"n"]
[{"$nulls":193},"2002-01-07","2002-01-08",null,"n"]
[{"$nulls":195},"2002-01-07","2002-01-08",null,"n"]
[{"$nulls":197},"2002-01-07","2002-01-08",null,"n"]
[{"$nulls":199},"2002-01-07","2002-01-08",null,"n"]
[{"$nulls":201},"2002-01-07","2002-01-08",null,"n"]
[{"$nulls":203},"2002-01-07","2002-01-08",null,"n"]
[{"$nulls":205},"2002-01-07","2002-01-08",null,"n"]
[{"$nulls":207},"2002-01-07","2002-01-08",null,"n"]
[{"$nulls":209},"2002-01-07","2002-01-08",null,"n"]
[{"$nulls":211},"2002-01-07","2002-01-08",null,"n"]
[{"$nulls":213},"2002-01-07","2002-01-08",null,"n"]
[{"$nulls":215},"2002-01-07","2002-01-08",null,"n"]
[{"$nulls":217},"2002-01-07","2002-01-08",null,"n"]
[{"$nulls":219},"2002-01-07","2002-01-08",null,"n"]
[{"$nulls":221},"2002-01-07","2002-01-08",null,"n"]
[{"$nulls":223},"2002-01-07","2002-01-08",null,"n"]
[{"$nulls":225},"2002-01-07","2002-01-08",null,"n"]

{"sheet":"F_Dupond","index":7,"n_rows":117,"n_cols":229,"rows_kept":117}
[]
[]
[null,null,{"$f":"NOW()","v":"2018-01-16T06:35:52.920"}]
[]
[null,null,"Nom","Dupond"]
[]
[{"$nulls":4},"Congés","Maladie","Maternité","Evnt. Familial","Congé Parental","Absence non rému.","Congé Paternité","Demi-journée"]
[null,null,"Date début","Date fin","CP","Mal","Mat","Evf","Cpa","AbsNR","Cpat","Dj"]
[null,null,"2018-01-02","2018-01-04",null,3]
[null,null,"2018-01-09","2018-01-11",{"$nulls":5},3]
{"$rows_empty":14}
[{"$nulls":4},{"$f":"SUM(E9:E24)","v":0},3,0,0,0,3,0,0]
{"$rows_empty":12}
[{"$nulls":70},"n"]
[{"$nulls":69},"2002-01-07","2002-01-08",null,"n"]
[{"$nulls":71},"2002-01-07","2002-01-08",null,"n"]
[{"$nulls":73},"2002-01-07","2002-01-08",null,"n"]
[{"$nulls":75},"2002-01-07","2002-01-08",null,"n"]
[{"$nulls":77},"2002-01-07","2002-01-08",null,"n"]
[{"$nulls":79},"2002-01-07","2002-01-08",null,"n"]
[{"$nulls":81},"2002-01-07","2002-01-08",null,"n"]
[{"$nulls":83},"2002-01-07","2002-01-08",null,"n"]
[{"$nulls":85},"2002-01-07","2002-01-08",null,"n"]
[{"$nulls":87},"2002-01-07","2002-01-08",null,"n"]
[{"$nulls":89},"2002-01-07","2002-01-08",null,"n"]
[{"$nulls":91},"2002-01-07","2002-01-08",null,"n"]
[{"$nulls":93},"2002-01-07","2002-01-08",null,"n"]
[{"$nulls":95},"2002-01-07","2002-01-08",null,"n"]
[{"$nulls":97},"2002-01-07","2002-01-08",null,"n"]
[{"$nulls":99},"2002-01-07","2002-01-08",null,"n"]
[{"$nulls":101},"2002-01-07","2002-01-08",null,"n"]
[{"$nulls":103},"2002-01-07","2002-01-08",null,"n"]
[{"$nulls":105},"2002-01-07","2002-01-08",null,"n"]
[{"$nulls":107},"2002-01-07","2002-01-08",null,"n"]
[{"$nulls":109},"2002-01-07","2002-01-08",null,"n"]
[{"$nulls":111},"2002-01-07","2002-01-08",null,"n"]
[{"$nulls":113},"2002-01-07","2002-01-08",null,"n"]
[{"$nulls":115},"2002-01-07","2002-01-08",null,"n"]
[{"$nulls":117},"2002-01-07","2002-01-08",null,"n"]
[{"$nulls":119},"2002-01-07","2002-01-08",null,"n"]
[{"$nulls":121},"2002-01-07","2002-01-08",null,"n"]
[{"$nulls":123},"2002-01-07","2002-01-08",null,"n"]
[{"$nulls":125},"2002-01-07","2002-01-08",null,"n"]
[{"$nulls":127},"2002-01-07","2002-01-08",null,"n"]
[{"$nulls":129},"2002-01-07","2002-01-08",null,"n"]
[{"$nulls":131},"2002-01-07","2002-01-08",null,"n"]
[{"$nulls":133},"2002-01-07","2002-01-08",null,"n"]
[{"$nulls":135},"2002-01-07","2002-01-08",null,"n"]
[{"$nulls":137},"2002-01-07","2002-01-08",null,"n"]
[{"$nulls":139},"2002-01-07","2002-01-08",null,"n"]
[{"$nulls":141},"2002-01-07","2002-01-08",null,"n"]
[{"$nulls":143},"2002-01-07","2002-01-08",null,"n"]
[{"$nulls":145},"2002-01-07","2002-01-08",null,"n"]
[{"$nulls":147},"2002-01-07","2002-01-08",null,"n"]
[{"$nulls":149},"2002-01-07","2002-01-08",null,"n"]
[{"$nulls":151},"2002-01-07","2002-01-08",null,"n"]
[{"$nulls":153},"2002-01-07","2002-01-08",null,"n"]
[{"$nulls":155},"2002-01-07","2002-01-08",null,"n"]
[{"$nulls":157},"2002-01-07","2002-01-08",null,"n"]
[{"$nulls":159},"2002-01-07","2002-01-08",null,"n"]
[{"$nulls":161},"2002-01-07","2002-01-08",null,"n"]
[{"$nulls":163},"2002-01-07","2002-01-08",null,"n"]
[{"$nulls":165},"2002-01-07","2002-01-08",null,"n"]
[{"$nulls":167},"2002-01-07","2002-01-08",null,"n"]
[{"$nulls":169},"2002-01-07","2002-01-08",null,"n"]
[{"$nulls":171},"2002-01-07","2002-01-08",null,"n"]
[{"$nulls":173},"2002-01-07","2002-01-08",null,"n"]
[{"$nulls":175},"2002-01-07","2002-01-08",null,"n"]
[{"$nulls":177},"2002-01-07","2002-01-08",null,"n"]
[{"$nulls":179},"2002-01-07","2002-01-08",null,"n"]
[{"$nulls":181},"2002-01-07","2002-01-08",null,"n"]
[{"$nulls":183},"2002-01-07","2002-01-08",null,"n"]
[{"$nulls":185},"2002-01-07","2002-01-08",null,"n"]
[{"$nulls":187},"2002-01-07","2002-01-08",null,"n"]
[{"$nulls":189},"2002-01-07","2002-01-08",null,"n"]
[{"$nulls":191},"2002-01-07","2002-01-08",null,"n"]
[{"$nulls":193},"2002-01-07","2002-01-08",null,"n"]
[{"$nulls":195},"2002-01-07","2002-01-08",null,"n"]
[{"$nulls":197},"2002-01-07","2002-01-08",null,"n"]
[{"$nulls":199},"2002-01-07","2002-01-08",null,"n"]
[{"$nulls":201},"2002-01-07","2002-01-08",null,"n"]
[{"$nulls":203},"2002-01-07","2002-01-08",null,"n"]
[{"$nulls":205},"2002-01-07","2002-01-08",null,"n"]
[{"$nulls":207},"2002-01-07","2002-01-08",null,"n"]
[{"$nulls":209},"2002-01-07","2002-01-08",null,"n"]
[{"$nulls":211},"2002-01-07","2002-01-08",null,"n"]
[{"$nulls":213},"2002-01-07","2002-01-08",null,"n"]
[{"$nulls":215},"2002-01-07","2002-01-08",null,"n"]
[{"$nulls":217},"2002-01-07","2002-01-08",null,"n"]
[{"$nulls":219},"2002-01-07","2002-01-08",null,"n"]
[{"$nulls":221},"2002-01-07","2002-01-08",null,"n"]
[{"$nulls":223},"2002-01-07","2002-01-08",null,"n"]
[{"$nulls":225},"2002-01-07","2002-01-08",null,"n"]